{"text_format":"1","workbook":"xlsx","n_sheets":3,"sheets":["AusOpen","Lookups","Betfair"],"not_rendered":{"charts":0,"images":1,"macros":1,"external_links":0,"defined_names":7,"comments":0,"pivot_tables":0},"unopened":[],"bounds":{"document_bytes":16777216,"sheet_cells":100000,"rows_first":2000,"rows_last":500,"rows_between":2000,"halvings":0,"cell_chars":16384,"cell_head_chars":4096},"cells_cut":0,"cells_raw":0,"read":"whole","date_system":"1900"}

{"sheet":"AusOpen","index":0,"n_rows":166,"n_cols":41,"rows_kept":166,"cut":false,"hidden":false,"merged":[[154,0,154,2],[154,20,154,31],[4,27,4,31],[5,20,5,22],[5,23,5,25],[5,26,5,28],[5,29,5,31]]}
[]
[null,null,null,null,null,null,null,null,null,null,null,null,null,null,null,null,null,null,null,null,null,null,null,null,null,null,null,null,null,null,null,null,null,null,null,"Year:",2018]
[null,null,null,null,null,null,{"$f":"\"Australian Open \" & AK2","v":"Australian Open 2018"}]
[null,null,null,null,null,null,null,null,null,null,null,null,null,0]
[null,null,null,null,null,null,null,null,null,null,null,null,null,0,null,null,null,null,null,null,null,null,null,null,null,null,null,"2018-11-18T17:59:15"]
["Grp","No.","2015/","Name",null,null,"Betfair","P1","True P1","P2","True P2","P3","True P3","P4","True P4","P5","True P5","EV","Buddy EV","Total EV",28000,null,null,32000,null,null,36000,null,null,19075,null,null,null,null,"Prizemoney"]
[null,null,"Buddy rank",null,null,null,null,null,0.45,null,0.22500000000000001,null,0.17499999999999999,null,0.1,null,0.05,null,null,null,null,null,null,null,null,null,null,null,null,null,null,null,null,null,"Group:",1,2,3,4]
[1,1,72.3,{"$f":"INDEX(BFnames,MATCH(B8,Lookups!A$2:A$145,0),2)","v":"Cameron Smith"},null,null,{"$f":"INDEX(BFnames,MATCH(B8,Lookups!A$2:A$145,0),4)","v":8.2017806556050168},{"$f":"IF(G8<>\"Scr\",1/G8,\"\")","v":0.1219247431734973},{"$f":"IF(H8<>\"\",+H8/$H$153,0)","v":0.11035691640218973},{"$f":"(1-I8)*I8/(1-I8/92)","v":9.829617678443392E-2},{"$f":"IF(J8<>\"\",+J8/$J$153,0)","v":0.10260877761972537},{"$f":"(1-I8-K8)*(I8+K8)/(1-(I8+K8)/92)","v":0.16800020153423958},{"$f":"IF(L8<>\"\",+L8/$L$153,0)","v":9.1426257552703852E-2},{"$f":"(1-I8-K8-M8)*(I8+K8+M8)/(1-(I8+K8+M8)/92)","v":0.21244037334595309},{"$f":"IF(N8<>\"\",+N8/$N$153,0)","v":8.0133382147029975E-2},{"$f":"(1-I8-K8-M8-O8)*(I8+K8+M8+O8)/(1-(I8+K8+M8+O8)/92)","v":0.23765892620781637},{"$f":"IF(P8<>\"\",+P8/$P$153,0)","v":6.9670037843899982E-2},{"$f":"+I$7*I8+K$7*K8+M$7*M8+O$7*O8+Q$7*Q8","v":0.10024402252404475},{"$f":"INDEX(Group4,44-ROW(),16)","v":1.0015700037326455E-2},{"$f":"+R8+S8","v":0.1102597225613712},{"$f":"ROUND(+$R8*U$6,0)","v":2807},{"$f":"INDEX(Group4,44-ROW(),21)","v":69},{"$f":"+U8+V8","v":2876},{"$f":"ROUND(+$R8*X$6,0)","v":3208},{"$f":"INDEX(Group4,44-ROW(),24)","v":79},{"$f":"+X8+Y8","v":3287},{"$f":"ROUND(+$R8*AA$6,0)","v":3609},{"$f":"INDEX(Group4,44-ROW(),27)","v":89},{"$f":"+AA8+AB8","v":3698},{"$f":"ROUND(+$R8*AD$6,0)","v":1912},{"$f":"INDEX(Group4,44-ROW(),30)","v":47},{"$f":"+AD8+AE8","v":1959},"M",1975,2012,{"$f":"40700*0.05","v":2035},{"$f":"40700*0.85","v":34595},{"$f":"40700*0.05","v":2035},{"$f":"40700*0.05","v":2035},{"$f":"SUM(AJ8:AM8)","v":40700}]
[1,2,null,{"$f":"INDEX(BFnames,MATCH(B9,Lookups!A$2:A$145,0),2)","v":"Keegan Bradley"},null,null,{"$f":"INDEX(BFnames,MATCH(B9,Lookups!A$2:A$145,0),4)","v":11.120135363790187},8.992696287279367E-2,8.1394982394458693E-2,7.4836048788438442E-2,7.811937085723776E-2,0.13430238477194442,7.308779577624272E-2,0.17895082785126848,6.7500987914293001E-2,0.21072863898316857,6.1775387472351673E-2,7.6833832946274258E-2,1.0015700037326455E-2,8.6849532983600708E-2,{"$f":"ROUND(+$R9*U$6,0)","v":2151},69,{"$f":"+U9+V9","v":2220},{"$f":"ROUND(+$R9*X$6,0)","v":2459},79,{"$f":"+X9+Y9","v":2538},{"$f":"ROUND(+$R9*AA$6,0)","v":2766},89,{"$f":"+AA9+AB9","v":2855},{"$f":"ROUND(+$R9*AD$6,0)","v":1466},47,{"$f":"+AD9+AE9","v":1513},null,null,2013,{"$f":"44150*0.85","v":37527.5},null,null,{"$f":"44150*0.15","v":6622.5},{"$f":"SUM(AJ9:AM9)","v":44150}]
[1,3,null,{"$f":"INDEX(BFnames,MATCH(B10,Lookups!A$2:A$145,0),2)","v":"Matt Kuchar"},null,null,{"$f":"INDEX(BFnames,MATCH(B10,Lookups!A$2:A$145,0),4)","v":11.620949074074074},8.6051491459588667E-2,7.788720322155078E-2,7.1881641796337478E-2,7.5035343584076764E-2,0.12975291698977709,7.0611960572584426E-2,0.17398957785215433,6.562958401942906E-2,0.20619631278987674,6.0446729877006722E-2,7.3874581752110632E-2,1.0440931497058133E-2,8.4315513249168764E-2,2068,72,2140,2364,83,2447,2659,93,2752,1409,49,1458,"G",1450,2014,{"$f":"37550/2","v":18775},{"$f":"37550*0.275","v":10326.25},8448.75,null,{"$f":"SUM(AJ10:AM10)","v":37550}]
[1,4,null,{"$f":"INDEX(BFnames,MATCH(B11,Lookups!A$2:A$145,0),2)","v":"Brandt Snedeker"},null,null,{"$f":"INDEX(BFnames,MATCH(B11,Lookups!A$2:A$145,0),4)","v":12.100284495021338},8.2642685005583957E-2,7.4801813340183251E-2,6.9262817108124708E-2,7.2301621797041554E-2,0.12566494652228966,6.8387273712597646E-2,0.16945136754605034,6.3917752435842037E-2,0.20195271323086245,5.9202712887666473E-2,7.1248364695088939E-2,1.0552940987536084E-2,8.1801305682625031E-2,1995,73,2068,2280,84,2364,2565,94,2659,1359,50,1409,"G",1325,2015,34510,5075,null,1015,{"$f":"SUM(AJ11:AM11)","v":40600}]
[1,5,null,{"$f":"INDEX(BFnames,MATCH(B12,Lookups!A$2:A$145,0),2)","v":"Byeong Hun An"},null,null,{"$f":"INDEX(BFnames,MATCH(B12,Lookups!A$2:A$145,0),4)","v":16.148387096774194},6.1925689172992411E-2,5.6050379318718924E-2,5.2940988236861691E-2,5.5263696581786863E-2,9.9043088165982326E-2,5.3899571576601683E-2,0.13816621712843824,5.2116865088222518E-2,0.17050073273906163,4.9982521977549932E-2,5.4800240057930591E-2,1.0581319830961611E-2,6.5381559888892202E-2,1534,73,1607,1754,84,1838,1973,94,2067,1045,50,1095,null,null,2018,{"$f":"19075*0.785","v":14973.875},{"$f":"19075*0.195","v":3719.625},{"$f":"19075*0.02","v":381.5},null,{"$f":"SUM(AJ12:AM12)","v":19075}]
[1,6,null,{"$f":"INDEX(BFnames,MATCH(B13,Lookups!A$2:A$145,0),2)","v":"Abraham Ancer"},null,null,{"$f":"INDEX(BFnames,MATCH(B13,Lookups!A$2:A$145,0),4)","v":16.826039387308533},5.9431692567787242E-2,5.3793005075360265E-2,5.0929096257860393E-2,5.3163535787934452E-2,9.5628013594458439E-2,5.2041076857628397E-2,0.1339488704027165,5.0526064566193477E-2,0.16600156601510438,4.8663585125794488E-2,5.2761621999191419E-2,1.0903866493351821E-2,6.3665488492543235E-2,1477,76,1553,1688,86,1774,1899,97,1996,1006,51,1057,"G",950]
[1,7,null,{"$f":"INDEX(BFnames,MATCH(B14,Lookups!A$2:A$145,0),2)","v":"Cameron Davis"},null,null,{"$f":"INDEX(BFnames,MATCH(B14,Lookups!A$2:A$145,0),4)","v":21.682017543859651},4.6121169212096691E-2,4.1745341287025693E-2,4.0020827366736025E-2,4.1776682570640281E-2,7.6615650760240531E-2,4.1694487000637076E-2,0.10968662514164575,4.1374245914075743E-2,0.13909013665130138,4.0774462961832056E-2,4.1657840122166286E-2,1.1088228186546591E-2,5.2746068308712875E-2,1166,77,1243,1333,88,1421,1500,99,1599,795,52,847,"G",875]
[1,8,null,{"$f":"INDEX(BFnames,MATCH(B15,Lookups!A$2:A$145,0),2)","v":"Anirban Lahiri"},null,null,{"$f":"INDEX(BFnames,MATCH(B15,Lookups!A$2:A$145,0),4)","v":33.354838709677416},2.9980657640232111E-2,2.7136189445793709E-2,2.6407605818093635E-2,2.7566200858457329E-2,5.1740803425596366E-2,2.8157513959935897E-2,7.6062646438233586E-2,2.8691142922365378E-2,9.9227725805130479E-2,2.9088742940639453E-2,2.7664796826017364E-2,1.1119562879200776E-2,3.8784359705218138E-2,775,77,852,885,88,973,996,99,1095,528,52,580,"G",525]
[1,9,null,{"$f":"INDEX(BFnames,MATCH(B16,Lookups!A$2:A$145,0),2)","v":"Brendan Steele"},null,null,{"$f":"INDEX(BFnames,MATCH(B16,Lookups!A$2:A$145,0),4)","v":38.143344709897612},2.6216893342877596E-2,2.3729518977522551E-2,2.3172405754901818E-2,2.4189061129336761E-2,4.5646164780919492E-2,2.4840791733829956E-2,6.7518843787661501E-2,2.5468385439859086E-2,8.8673741314301391E-2,2.5994828015529381E-2,2.4314540792168535E-2,1.1497645953869488E-2,3.5812186746038019E-2,681,80,761,778,91,869,875,102,977,464,54,518,"G",475]
[1,10,81.5,{"$f":"INDEX(BFnames,MATCH(B17,Lookups!A$2:A$145,0),2)","v":"Nicolas Colsaerts"},null,null,{"$f":"INDEX(BFnames,MATCH(B17,Lookups!A$2:A$145,0),4)","v":68.811881188118818},1.4532374100719423E-2,1.3153589271673333E-2,1.2982428508036145E-2,1.355201355050073E-2,2.5999960824286676E-2,1.4149263470954699E-2,3.9203155320134908E-2,1.4787591346970233E-2,5.2578174317839156E-2,1.5413363398283954E-2,1.3693866633143958E-2,1.1821075544743192E-2,2.5514942177887148E-2,383,82,465,438,94,532,493,105,598,261,56,317]
[1,11,765,{"$f":"INDEX(BFnames,MATCH(B18,Lookups!A$2:A$145,0),2)","v":"Dimitrios Papadatos"},null,null,{"$f":"INDEX(BFnames,MATCH(B18,Lookups!A$2:A$145,0),4)","v":592},1.6891891891891893E-3,1.5289243617562496E-3,1.5266121224268966E-3,1.5935899940971493E-3,3.1128699119181476E-3,1.694033957674081E-3,4.7936001389868605E-3,1.8081656784322705E-3,6.581301061236936E-3,1.9293173680231673E-3,1.6203120902995205E-3,1.1956010019726565E-2,1.3576322110026086E-2,45,83,128,52,95,147,58,107,165,31,56,87,null,null,"Cost"]
[1,12,55,{"$f":"INDEX(BFnames,MATCH(B19,Lookups!A$2:A$145,0),2)","v":"Marcus Fraser"},null,null,{"$f":"INDEX(BFnames,MATCH(B19,Lookups!A$2:A$145,0),4)","v":64.078947368421055},1.5605749486652977E-2,1.4125126259576423E-2,1.3927745449933878E-2,1.4538804889130941E-2,2.7850987577965593E-2,1.5156598266825782E-2,4.1920257659491568E-2,1.5812493519109086E-2,5.6113297309725287E-2,1.6449689517220391E-2,1.4683676441330291E-2,1.2149568295595624E-2,2.6833244736925915E-2,411,84,495,470,96,566,529,108,637,280,57,337,null,null,2012,27350,6600,5200,2550,{"$f":"SUM(AJ19:AM19)","v":41700},7]
[2,13,93,{"$f":"INDEX(BFnames,MATCH(B20,Lookups!A$2:A$145,0),2)","v":"Rod Pampling"},null,null,{"$f":"INDEX(BFnames,MATCH(B20,Lookups!A$2:A$145,0),4)","v":89.2},1.1210762331838564E-2,1.0147121324660309E-2,1.0045265193968384E-2,1.0485986496499171E-2,2.0211915667965642E-2,1.0999390421066504E-2,3.0642419126194021E-2,1.1558446462293141E-2,4.1344897056165154E-2,1.2120312872390814E-2,1.0612305171344948E-2,1.2496836300327184E-2,2.3109141471672132E-2,297,87,384,340,99,439,382,112,494,202,59,261,"W",300,2013,32850,6150,3750,2400,{"$f":"SUM(AJ20:AM20)","v":45150},10]
[2,14,25.2,{"$f":"INDEX(BFnames,MATCH(B21,Lookups!A$2:A$145,0),2)","v":"John Senden"},null,null,{"$f":"INDEX(BFnames,MATCH(B21,Lookups!A$2:A$145,0),4)","v":68.07692307692308},1.4689265536723162E-2,1.3295595353758299E-2,1.3120718669318916E-2,1.3696370990131148E-2,2.6271107801753721E-2,1.4296822540349547E-2,3.9601797734386643E-2,1.4937960904404725E-2,5.3097753637154355E-2,1.5565678783265303E-2,1.3838725356135652E-2,1.2513868625563317E-2,2.6352593981698969E-2,387,87,474,443,99,542,498,112,610,264,59,323,"M",350,2014,26500,6150,4050,1850,{"$f":"SUM(AJ21:AM21)","v":38550},10]
[2,15,null,{"$f":"INDEX(BFnames,MATCH(B22,Lookups!A$2:A$145,0),2)","v":"Matthew Griffin"},null,null,{"$f":"INDEX(BFnames,MATCH(B22,Lookups!A$2:A$145,0),4)","v":85.597826086956516},1.1682539682539683E-2,1.0574137960468874E-2,1.0463528205892303E-2,1.092260018566815E-2,2.1039544499331007E-2,1.1449788730136579E-2,3.1872467233263639E-2,1.202242566488344E-2,4.2967748181429635E-2,1.259605388963889E-2,1.1051705412730517E-2,1.2576719622235751E-2,2.3628425034966268E-2,309,87,396,354,100,454,398,112,510,211,59,270,"M",325,2015,28100,6775,4025,2700,{"$f":"SUM(AJ22:AM22)","v":41600},13]
[2,16,null,{"$f":"INDEX(BFnames,MATCH(B23,Lookups!A$2:A$145,0),2)","v":"Nick Voke"},null,null,{"$f":"INDEX(BFnames,MATCH(B23,Lookups!A$2:A$145,0),4)","v":83},1.2048192771084338E-2,1.0905099062165058E-2,1.0787456553591444E-2,1.1260740415340337E-2,2.1679738402994982E-2,1.1798184340293774E-2,3.2822586154967588E-2,1.2380814427993176E-2,4.421926959307497E-2,1.2962939095690594E-2,1.139187182856111E-2,1.2645666707178618E-2,2.4037538535739728E-2,319,88,407,365,100,465,410,113,523,217,60,277,null,null,2018,11150,3650,3325,1950,{"$f":"SUM(AJ23:AM23)","v":20075},12]
[2,17,601,{"$f":"INDEX(BFnames,MATCH(B24,Lookups!A$2:A$145,0),2)","v":"Rhein Gibson"},null,null,{"$f":"INDEX(BFnames,MATCH(B24,Lookups!A$2:A$145,0),4)","v":251.06060606060606},3.983101991550996E-3,3.6051981087833543E-3,3.5923414282332923E-3,3.7499501486418802E-3,7.3016337971789167E-3,3.9735729243179103E-3,1.1201760623595224E-2,4.22535015652762E-3,1.5314731403344033E-2,4.4895343653414618E-3,3.8084649280724016E-3,1.2657630597973658E-2,1.6466095526046061E-2,107,88,195,122,100,222,137,113,250,73,60,133]
[2,18,null,{"$f":"INDEX(BFnames,MATCH(B25,Lookups!A$2:A$145,0),2)","v":"Anthony Quayle"},null,null,{"$f":"INDEX(BFnames,MATCH(B25,Lookups!A$2:A$145,0),4)","v":159.42528735632186},6.2725306416726743E-3,5.6774131454862195E-3,5.6455285167422683E-3,5.8932178144690539E-3,1.1438190014312335E-2,6.2247003077085814E-3,1.7482038960069793E-2,6.5942969626362957E-3,2.3801084043254126E-2,6.9773201978088444E-3,5.9784281837274101E-3,1.2739589182360024E-2,1.8718017366087435E-2,167,88,255,191,101,292,215,114,329,114,60,174]
[2,19,null,{"$f":"INDEX(BFnames,MATCH(B26,Lookups!A$2:A$145,0),2)","v":"Cameron Percy"},null,null,{"$f":"INDEX(BFnames,MATCH(B26,Lookups!A$2:A$145,0),4)","v":65.9375},1.5165876777251185E-2,1.3726987255502554E-2,1.3540577416972814E-2,1.4134650425598852E-2,2.709357194949304E-2,1.4744410211747399E-2,4.0809671910974232E-2,1.5393576009262411E-2,5.4670133259408817E-2,1.6026624010677688E-2,1.4278401199251809E-2,1.2991958037027454E-2,2.7270359236279261E-2,400,90,490,457,103,560,514,116,630,272,61,333]
[2,20,null,{"$f":"INDEX(BFnames,MATCH(B27,Lookups!A$2:A$145,0),2)","v":"Zach Murray"},null,null,{"$f":"INDEX(BFnames,MATCH(B27,Lookups!A$2:A$145,0),4)","v":107.5609756097561},9.297052154195011E-3,8.4149778023917664E-3,8.3449292378715758E-3,8.7110507898889682E-3,1.6835861774438469E-2,9.162130882312219E-3,2.5604408371797956E-2,9.6580880949811449E-3,3.4667660206289169E-2,1.0162871797289955E-2,8.8240517425685651E-3,1.376451821379529E-2,2.2588569956363855E-2,247,96,343,282,109,391,318,123,441,168,65,233,"J",250]
[2,21,1200,{"$f":"INDEX(BFnames,MATCH(B28,Lookups!A$2:A$145,0),2)","v":"Brett Coletta"},null,null,{"$f":"INDEX(BFnames,MATCH(B28,Lookups!A$2:A$145,0),4)","v":114.47368421052632},8.7356321839080469E-3,7.9068235499008266E-3,7.8449799181207463E-3,8.1891669257388271E-3,1.5839680820069695E-2,8.6200059582260073E-3,2.4111593585245367E-2,9.0949922206825674E-3,3.2679815884273024E-2,9.5801325273938021E-3,8.2976400468741055E-3,1.3910489038665912E-2,2.220812908554002E-2,232,97,329,266,111,377,299,124,423,158,66,224]
[2,22,null,{"$f":"INDEX(BFnames,MATCH(B29,Lookups!A$2:A$145,0),2)","v":"Cameron John"},null,null,{"$f":"INDEX(BFnames,MATCH(B29,Lookups!A$2:A$145,0),4)","v":73.07692307692308},1.3684210526315788E-2,1.2385896724290626E-2,1.2234133359585649E-2,1.2770888048034236E-2,2.4530628688616062E-2,1.3349648130976031E-2,3.7039190214155499E-2,1.3971334813152625E-2,4.9752230807730856E-2,1.4584934210138048E-2,1.2909671951481455E-2,1.4169273971315474E-2,2.7078945922796929E-2,361,99,460,413,113,526,465,127,592,246,67,313,"M",350,"Result"]
[2,23,84.1,{"$f":"INDEX(BFnames,MATCH(B30,Lookups!A$2:A$145,0),2)","v":"Greg Chalmers"},null,null,{"$f":"INDEX(BFnames,MATCH(B30,Lookups!A$2:A$145,0),4)","v":98.835616438356169},1.0117810117810117E-2,9.1578648950323034E-3,9.0749017395538832E-3,9.4730497662875689E-3,1.8287507082200494E-2,9.952120992863224E-3,2.7774674906574121E-2,1.0476721553645426E-2,3.7550034914334215E-2,1.1007843867954784E-2,9.5921609226925844E-3,1.4315317356871393E-2,2.3907478279563979E-2,269,100,369,307,114,421,345,128,473,183,68,251,null,null,2012,{"$f":"+AJ8-AJ19","v":-25315},{"$f":"+AK8-AK19","v":27995},-3165,-515,-1000]
{"$rows_left_out":137}
{"sheet":"Lookups","index":1,"n_rows":145,"n_cols":9,"rows_kept":145,"cut":false,"hidden":false,"merged":[]}
[]
[{"$f":"VLOOKUP(C2,BillsNames,3)","v":1},{"$f":"INDEX(BFX,ROW()-1,1)","v":"Cameron Smith"},{"$f":"RIGHT(B2,LEN(B2)-FIND(\" \",B2,2))&\" \"&LEFT(B2,IF(RIGHT(B2,5)=\"Brown\",2,1))","v":"Smith C"},{"$f":"INDEX(BFX,ROW()-1,14)","v":8.2017806556050168},null,null,{"$f":"RIGHT(H2,LEN(H2)-FIND(\" \",H2,2))&\" \"&LEFT(H2,1)","v":"Allan S"},"S. Allan",41]
[2,"Keegan Bradley","Bradley K",11.120135363790187,null,null,"Allenby R","R. Allenby",40]
[3,"Matt Kuchar","Kuchar M",11.620949074074074,null,null,"An S","S. An",39]
[4,"Brandt Snedeker","Snedeker B",12.100284495021338,null,null,"Ancer A","A. Ancer",6]
[5,"Byeong Hun An","Hun An B",16.148387096774194,null,null,"Anstiss J","J. Anstiss",38]
[6,"Abraham Ancer","Ancer A",16.826039387308533,null,null,"Antcliff M","M. Antcliff",43]
[7,"Cameron Davis","Davis C",21.682017543859651,null,null,"Armstrong D","D. Armstrong",42]
[8,"Anirban Lahiri","Lahiri A",33.354838709677416,null,null,"Arnold J","J. Arnold",37]
[9,"Brendan Steele","Steele B",38.143344709897612,null,null,"Basic N","N. Basic",53]
[11,"Dimitrios Papadatos","Papadatos D",592,null,null,"Bateman H","H. Bateman",47]
[10,"Nicolas Colsaerts","Colsaerts N",68.811881188118818,null,null,"Bauchou Z","Z. Bauchou",48]
[17,"Rhein Gibson","Gibson R",251.06060606060606,null,null,"Beck D","D. Beck",51]
[22,"Cameron John","John C",73.07692307692308,null,null,"Becker B","B. Becker",44]
[18,"Anthony Quayle","Quayle A",159.42528735632186,null,null,"Bland A","A. Bland",30]
[12,"Marcus Fraser","Fraser M",64.078947368421055,null,null,"Blyth A","A. Blyth",46]
[21,"Brett Coletta","Coletta B",114.47368421052632,null,null,"Bourke R","R. Bourke",54]
[13,"Rod Pampling","Pampling R",89.2,null,null,"Bradley K","K. Bradley",2]
[19,"Cameron Percy","Percy C",65.9375,null,null,"Brandt Richards D","D. Brandt Richards",50]
[14,"John Senden","Senden J",68.07692307692308,null,null,{"$f":"RIGHT(H20,LEN(H20)-FIND(\" \",H20,2))&\" \"&LEFT(H20,2)","v":"Brown Ma"},"Mark Brown",45]
[29,"Harrison Endycott","Endycott H",71.25,null,null,{"$f":"RIGHT(H21,LEN(H21)-FIND(\" \",H21,2))&\" \"&LEFT(H21,2)","v":"Brown Mi"},"Mitchell Brown",52]
[16,"Nick Voke","Voke N",83,null,null,{"$f":"RIGHT(H22,LEN(H22)-FIND(\" \",H22,2))&\" \"&LEFT(H22,1)","v":"Burdett A"},"A. Burdett",49]
[15,"Matthew Griffin","Griffin M",85.597826086956516,null,null,"Campbell B","B. Campbell",57]
[26,"Matthew Millar","Millar M",84.954545454545453,null,null,"Chalmers G","G. Chalmers",23]
[126,"Michael Sim","Sim M",872.58064516129036,null,null,"Chisnall R","R. Chisnall",58]
[30,"Adam Bland","Bland A",195.0632911392405,null,null,"Choat A","A. Choat",59]
[23,"Greg Chalmers","Chalmers G",98.835616438356169,null,null,"Clementson B","B. Clementson",60]
[36,"Andrew Dodt","Dodt A",117.90322580645162,null,null,"Coletta B","B. Coletta",21]
[31,"Ben Eccles","Eccles B",810.90909090909088,null,null,"Colsaerts N","N. Colsaerts",10]
[34,"Jarryd Felton","Felton J",153.33333333333334,null,null,"Cooke P","P. Cooke",55]
{"$rows_left_out":116}
{"sheet":"Betfair","index":2,"n_rows":169,"n_cols":16,"rows_kept":169,"cut":false,"hidden":false,"merged":[]}
[null,"144 selections",1.2889999999999999,"Back all","Lay all",0.86499999999999999]
[]
[null,"Cameron Smith","7.8$225","8$1075","8.2$22","8.4$2449","8.8$171","9$732",{"$f":"FIND(\"$\",E3)","v":4},{"$f":"IF(ISBLANK(F3),0,FIND(\"$\",F3))","v":4},{"$f":"VALUE(LEFT(E3,I3-1))","v":8.1999999999999993},{"$f":"VALUE(RIGHT(E3,LEN(E3)-I3))","v":22},{"$f":"IF(J3,VALUE(LEFT(F3,J3-1)),0)","v":8.4},{"$f":"IF(J3,VALUE(RIGHT(F3,LEN(F3)-J3)),0)","v":2449},{"$f":"IF(M3,K3+(M3-K3)*L3/(L3+N3),K3+IF(K3=1000,L3*10,L3))","v":8.2017806556050168}]
[null,"Keegan Bradley","10$850","10.5$17","11$142","11.5$449","12.5$27","13$43",3,5,11,142,11.5,449,{"$f":"IF(M4,K4+(M4-K4)*L4/(L4+N4),K4+IF(K4=1000,L4*10,L4))","v":11.120135363790187}]
[null,"Matt Kuchar","10.5$629","11$35","11.5$209","12$655","13$40","13.5$10",5,3,11.5,209,12,655,11.620949074074074]
[null,"Brandt Snedeker","11$844","11.5$108","12$141","12.5$562","13$44","14$11",3,5,12,141,12.5,562,12.100284495021338]
[null,"Byeong Hun An","14.5$325","15.5$15","16$138","16.5$327","17$65","18$10",3,5,16,138,16.5,327,16.148387096774194]
[null,"Abraham Ancer","15$125","16$365","16.5$149","17.5$308","18.5$51","19$7",5,5,16.5,149,17.5,308,16.826039387308533]
[null,"Cameron Davis","19.5$413","20$25","21$311","22$145","23$578","25$10",3,3,21,311,22,145,21.682017543859651]
[null,"Anirban Lahiri","28$51","29$23","30$26","34$5","36$149","40$97",3,3,30,26,34,5,33.354838709677416]
[null,"Brendan Steele","34$12","36$6","38$21","40$272","42$78","46$10",3,3,38,21,40,272,38.143344709897612]
[null,"Dimitrios Papadatos","65$24","70$16","200$28","690$7","700$10",null,4,4,200,28,690,7,592]
[null,"Nicolas Colsaerts","50$8","55$7","60$89","70$12","80$12","85$7",3,3,60,89,70,12,68.811881188118818]
[null,"Rhein Gibson","48$72","50$33","110$49","300$17",null,null,4,4,110,49,300,17,251.06060606060606]
[null,"Cameron John","50$82","55$8","65$21","75$5","85$5","90$7",3,3,65,21,75,5,73.07692307692308]
[null,"Anthony Quayle","70$18","80$6","95$59","190$28",null,null,3,4,95,59,190,28,159.42528735632186]
[null,"Marcus Fraser","44$11","48$30","50$107","65$7","80$11","90$10",3,3,50,107,65,7,64.078947368421055]
[null,"Brett Coletta","65$85","75$17","90$62","120$14",null,null,3,4,90,62,120,14,114.47368421052632]
[null,"Rod Pampling","50$74","70$10","85$63","90$12","100$15",null,3,3,85,63,90,12,89.2]
[null,"Cameron Percy","50$8","55$62","60$114","70$78","75$9","80$27",3,3,60,114,70,78,65.9375]
[null,"John Senden","48$47","50$98","55$34","70$5","75$15","85$10",3,3,55,34,70,5,68.07692307692308]
[null,"Harrison Endycott","60$30","65$92","70$5","80$35","90$13","95$101",3,3,70,5,80,35,71.25]
[null,"Nick Voke","55$200","65$10","70$13",null,null,null,3,0,70,13,0,0,83]
[null,"Matthew Griffin","60$153","65$85","75$39","100$53","110$19",null,3,4,75,39,100,53,85.597826086956516]
[null,"Matthew Millar","60$196","65$45","75$73","90$37",null,null,3,3,75,73,90,37,84.954545454545453]
[null,"Michael Sim","100$34","130$17","210$26","1000$5",null,null,4,5,210,26,1000,5,872.58064516129036]
[null,"Adam Bland","90$56","95$12","110$56","230$23","380$5",null,4,4,110,56,230,23,195.0632911392405]
[null,"Greg Chalmers","85$55","90$61","95$56","100$17","110$6","120$32",3,4,95,56,100,17,98.835616438356169]
[null,"Andrew Dodt","80$60","100$20","110$49","120$13","1000$7",null,4,4,110,49,120,13,117.90322580645162]
[null,"Ben Eccles","90$38","130$8","200$28","920$5",null,null,4,4,200,28,920,5,810.90909090909088]
{"$rows_left_out":139}