{"text_format":"1","workbook":"xlsx","n_sheets":3,"sheets":["AusOpen","Lookups","Betfair"],"not_rendered":{"charts":0,"images":1,"macros":1,"external_links":0,"defined_names":7,"comments":0,"pivot_tables":0},"unopened":[],"bounds":{"document_bytes":16777216,"sheet_cells":100000,"rows_first":2000,"rows_last":500,"rows_between":2000,"halvings":0,"cell_chars":16384,"cell_head_chars":4096},"cells_cut":0,"cells_raw":0,"read":"whole","date_system":"1900"}

{"sheet":"AusOpen","index":0,"n_rows":166,"n_cols":41,"rows_kept":166,"cut":false,"hidden":false,"merged":[[154,0,154,2],[154,20,154,31],[4,27,4,31],[5,20,5,22],[5,23,5,25],[5,26,5,28],[5,29,5,31]]}
[]
[null,null,null,null,null,null,null,null,null,null,null,null,null,null,null,null,null,null,null,null,null,null,null,null,null,null,null,null,null,null,null,null,null,null,null,"Year:",2018]
[null,null,null,null,null,null,{"$f":"\"Australian Open \" & AK2","v":"Australian Open 2018"}]
[null,null,null,null,null,null,null,null,null,null,null,null,null,0]
[null,null,null,null,null,null,null,null,null,null,null,null,null,0,null,null,null,null,null,null,null,null,null,null,null,null,null,"2018-11-18T17:59:15"]
["Grp","No.","2015/","Name",null,null,"Betfair","P1","True P1","P2","True P2","P3","True P3","P4","True P4","P5","True P5","EV","Buddy EV","Total EV",28000,null,null,32000,null,null,36000,null,null,19075,null,null,null,null,"Prizemoney"]
[null,null,"Buddy rank",null,null,null,null,null,0.45,null,0.22500000000000001,null,0.17499999999999999,null,0.1,null,0.05,null,null,null,null,null,null,null,null,null,null,null,null,null,null,null,null,null,"Group:",1,2,3,4]
[1,1,72.3,{"$f":"INDEX(BFnames,MATCH(B8,Lookups!A$2:A$145,0),2)","v":"Cameron Smith"},null,null,{"$f":"INDEX(BFnames,MATCH(B8,Lookups!A$2:A$145,0),4)","v":8.2017806556050168},{"$f":"IF(G8<>\"Scr\",1/G8,\"\")","v":0.1219247431734973},{"$f":"IF(H8<>\"\",+H8/$H$153,0)","v":0.11035691640218973},{"$f":"(1-I8)*I8/(1-I8/92)","v":9.829617678443392E-2},{"$f":"IF(J8<>\"\",+J8/$J$153,0)","v":0.10260877761972537},{"$f":"(1-I8-K8)*(I8+K8)/(1-(I8+K8)/92)","v":0.16800020153423958},{"$f":"IF(L8<>\"\",+L8/$L$153,0)","v":9.1426257552703852E-2},{"$f":"(1-I8-K8-M8)*(I8+K8+M8)/(1-(I8+K8+M8)/92)","v":0.21244037334595309},{"$f":"IF(N8<>\"\",+N8/$N$153,0)","v":8.0133382147029975E-2},{"$f":"(1-I8-K8-M8-O8)*(I8+K8+M8+O8)/(1-(I8+K8+M8+O8)/92)","v":0.23765892620781637},{"$f":"IF(P8<>\"\",+P8/$P$153,0)","v":6.9670037843899982E-2},{"$f":"+I$7*I8+K$7*K8+M$7*M8+O$7*O8+Q$7*Q8","v":0.10024402252404475},{"$f":"INDEX(Group4,44-ROW(),16)","v":1.0015700037326455E-2},{"$f":"+R8+S8","v":0.1102597225613712},{"$f":"ROUND(+$R8*U$6,0)","v":2807},{"$f":"INDEX(Group4,44-ROW(),21)","v":69},{"$f":"+U8+V8","v":2876},{"$f":"ROUND(+$R8*X$6,0)","v":3208},{"$f":"INDEX(Group4,44-ROW(),24)","v":79},{"$f":"+X8+Y8","v":3287},{"$f":"ROUND(+$R8*AA$6,0)","v":3609},{"$f":"INDEX(Group4,44-ROW(),27)","v":89},{"$f":"+AA8+AB8","v":3698},{"$f":"ROUND(+$R8*AD$6,0)","v":1912},{"$f":"INDEX(Group4,44-ROW(),30)","v":47},{"$f":"+AD8+AE8","v":1959},"M",1975,2012,{"$f":"40700*0.05","v":2035},{"$f":"40700*0.85","v":34595},{"$f":"40700*0.05","v":2035},{"$f":"40700*0.05","v":2035},{"$f":"SUM(AJ8:AM8)","v":40700}]
[1,2,null,{"$f":"INDEX(BFnames,MATCH(B9,Lookups!A$2:A$145,0),2)","v":"Keegan Bradley"},null,null,{"$f":"INDEX(BFnames,MATCH(B9,Lookups!A$2:A$145,0),4)","v":11.120135363790187},8.992696287279367E-2,8.1394982394458693E-2,7.4836048788438442E-2,7.811937085723776E-2,0.13430238477194442,7.308779577624272E-2,0.17895082785126848,6.7500987914293001E-2,0.21072863898316857,6.1775387472351673E-2,7.6833832946274258E-2,1.0015700037326455E-2,8.6849532983600708E-2,{"$f":"ROUND(+$R9*U$6,0)","v":2151},69,{"$f":"+U9+V9","v":2220},{"$f":"ROUND(+$R9*X$6,0)","v":2459},79,{"$f":"+X9+Y9","v":2538},{"$f":"ROUND(+$R9*AA$6,0)","v":2766},89,{"$f":"+AA9+AB9","v":2855},{"$f":"ROUND(+$R9*AD$6,0)","v":1466},47,{"$f":"+AD9+AE9","v":1513},null,null,2013,{"$f":"44150*0.85","v":37527.5},null,null,{"$f":"44150*0.15","v":6622.5},{"$f":"SUM(AJ9:AM9)","v":44150}]
[1,3,null,{"$f":"INDEX(BFnames,MATCH(B10,Lookups!A$2:A$145,0),2)","v":"Matt Kuchar"},null,null,{"$f":"INDEX(BFnames,MATCH(B10,Lookups!A$2:A$145,0),4)","v":11.620949074074074},8.6051491459588667E-2,7.788720322155078E-2,7.1881641796337478E-2,7.5035343584076764E-2,0.12975291698977709,7.0611960572584426E-2,0.17398957785215433,6.562958401942906E-2,0.20619631278987674,6.0446729877006722E-2,7.3874581752110632E-2,1.0440931497058133E-2,8.4315513249168764E-2,2068,72,2140,2364,83,2447,2659,93,2752,1409,49,1458,"G",1450,2014,{"$f":"37550/2","v":18775},{"$f":"37550*0.275","v":10326.25},8448.75,null,{"$f":"SUM(AJ10:AM10)","v":37550}]
[1,4,null,{"$f":"INDEX(BFnames,MATCH(B11,Lookups!A$2:A$145,0),2)","v":"Brandt Snedeker"},null,null,{"$f":"INDEX(BFnames,MATCH(B11,Lookups!A$2:A$145,0),4)","v":12.100284495021338},8.2642685005583957E-2,7.4801813340183251E-2,6.9262817108124708E-2,7.2301621797041554E-2,0.12566494652228966,6.8387273712597646E-2,0.16945136754605034,6.3917752435842037E-2,0.20195271323086245,5.9202712887666473E-2,7.1248364695088939E-2,1.0552940987536084E-2,8.1801305682625031E-2,1995,73,2068,2280,84,2364,2565,94,2659,1359,50,1409,"G",1325,2015,34510,5075,null,1015,{"$f":"SUM(AJ11:AM11)","v":40600}]
[1,5,null,{"$f":"INDEX(BFnames,MATCH(B12,Lookups!A$2:A$145,0),2)","v":"Byeong Hun An"},null,null,{"$f":"INDEX(BFnames,MATCH(B12,Lookups!A$2:A$145,0),4)","v":16.148387096774194},6.1925689172992411E-2,5.6050379318718924E-2,5.2940988236861691E-2,5.5263696581786863E-2,9.9043088165982326E-2,5.3899571576601683E-2,0.13816621712843824,5.2116865088222518E-2,0.17050073273906163,4.9982521977549932E-2,5.4800240057930591E-2,1.0581319830961611E-2,6.5381559888892202E-2,1534,73,1607,1754,84,1838,1973,94,2067,1045,50,1095,null,null,2018,{"$f":"19075*0.785","v":14973.875},{"$f":"19075*0.195","v":3719.625},{"$f":"19075*0.02","v":381.5},null,{"$f":"SUM(AJ12:AM12)","v":19075}]
[1,6,null,{"$f":"INDEX(BFnames,MATCH(B13,Lookups!A$2:A$145,0),2)","v":"Abraham Ancer"},null,null,{"$f":"INDEX(BFnames,MATCH(B13,Lookups!A$2:A$145,0),4)","v":16.826039387308533},5.9431692567787242E-2,5.3793005075360265E-2,5.0929096257860393E-2,5.3163535787934452E-2,9.5628013594458439E-2,5.2041076857628397E-2,0.1339488704027165,5.0526064566193477E-2,0.16600156601510438,4.8663585125794488E-2,5.2761621999191419E-2,1.0903866493351821E-2,6.3665488492543235E-2,1477,76,1553,1688,86,1774,1899,97,1996,1006,51,1057,"G",950]
[1,7,null,{"$f":"INDEX(BFnames,MATCH(B14,Lookups!A$2:A$145,0),2)","v":"Cameron Davis"},null,null,{"$f":"INDEX(BFnames,MATCH(B14,Lookups!A$2:A$145,0),4)","v":21.682017543859651},4.6121169212096691E-2,4.1745341287025693E-2,4.0020827366736025E-2,4.1776682570640281E-2,7.6615650760240531E-2,4.1694487000637076E-2,0.10968662514164575,4.1374245914075743E-2,0.13909013665130138,4.0774462961832056E-2,4.1657840122166286E-2,1.1088228186546591E-2,5.2746068308712875E-2,1166,77,1243,1333,88,1421,1500,99,1599,795,52,847,"G",875]
[1,8,null,{"$f":"INDEX(BFnames,MATCH(B15,Lookups!A$2:A$145,0),2)","v":"Anirban Lahiri"},null,null,{"$f":"INDEX(BFnames,MATCH(B15,Lookups!A$2:A$145,0),4)","v":33.354838709677416},2.9980657640232111E-2,2.7136189445793709E-2,2.6407605818093635E-2,2.7566200858457329E-2,5.1740803425596366E-2,2.8157513959935897E-2,7.6062646438233586E-2,2.8691142922365378E-2,9.9227725805130479E-2,2.9088742940639453E-2,2.7664796826017364E-2,1.1119562879200776E-2,3.8784359705218138E-2,775,77,852,885,88,973,996,99,1095,528,52,580,"G",525]
[1,9,null,{"$f":"INDEX(BFnames,MATCH(B16,Lookups!A$2:A$145,0),2)","v":"Brendan Steele"},null,null,{"$f":"INDEX(BFnames,MATCH(B16,Lookups!A$2:A$145,0),4)","v":38.143344709897612},2.6216893342877596E-2,2.3729518977522551E-2,2.3172405754901818E-2,2.4189061129336761E-2,4.5646164780919492E-2,2.4840791733829956E-2,6.7518843787661501E-2,2.5468385439859086E-2,8.8673741314301391E-2,2.5994828015529381E-2,2.4314540792168535E-2,1.1497645953869488E-2,3.5812186746038019E-2,681,80,761,778,91,869,875,102,977,464,54,518,"G",475]
[1,10,81.5,{"$f":"INDEX(BFnames,MATCH(B17,Lookups!A$2:A$145,0),2)","v":"Nicolas Colsaerts"},null,null,{"$f":"INDEX(BFnames,MATCH(B17,Lookups!A$2:A$145,0),4)","v":68.811881188118818},1.4532374100719423E-2,1.3153589271673333E-2,1.2982428508036145E-2,1.355201355050073E-2,2.5999960824286676E-2,1.4149263470954699E-2,3.9203155320134908E-2,1.4787591346970233E-2,5.2578174317839156E-2,1.5413363398283954E-2,1.3693866633143958E-2,1.1821075544743192E-2,2.5514942177887148E-2,383,82,465,438,94,532,493,105,598,261,56,317]
[1,11,765,{"$f":"INDEX(BFnames,MATCH(B18,Lookups!A$2:A$145,0),2)","v":"Dimitrios Papadatos"},null,null,{"$f":"INDEX(BFnames,MATCH(B18,Lookups!A$2:A$145,0),4)","v":592},1.6891891891891893E-3,1.5289243617562496E-3,1.5266121224268966E-3,1.5935899940971493E-3,3.1128699119181476E-3,1.694033957674081E-3,4.7936001389868605E-3,1.8081656784322705E-3,6.581301061236936E-3,1.9293173680231673E-3,1.6203120902995205E-3,1.1956010019726565E-2,1.3576322110026086E-2,45,83,128,52,95,147,58,107,165,31,56,87,null,null,"Cost"]
[1,12,55,{"$f":"INDEX(BFnames,MATCH(B19,Lookups!A$2:A$145,0),2)","v":"Marcus Fraser"},null,null,{"$f":"INDEX(BFnames,MATCH(B19,Lookups!A$2:A$145,0),4)","v":64.078947368421055},1.5605749486652977E-2,1.4125126259576423E-2,1.3927745449933878E-2,1.4538804889130941E-2,2.7850987577965593E-2,1.5156598266825782E-2,4.1920257659491568E-2,1.5812493519109086E-2,5.6113297309725287E-2,1.6449689517220391E-2,1.4683676441330291E-2,1.2149568295595624E-2,2.6833244736925915E-2,411,84,495,470,96,566,529,108,637,280,57,337,null,null,2012,27350,6600,5200,2550,{"$f":"SUM(AJ19:AM19)","v":41700},7]
[2,13,93,{"$f":"INDEX(BFnames,MATCH(B20,Lookups!A$2:A$145,0),2)","v":"Rod Pampling"},null,null,{"$f":"INDEX(BFnames,MATCH(B20,Lookups!A$2:A$145,0),4)","v":89.2},1.1210762331838564E-2,1.0147121324660309E-2,1.0045265193968384E-2,1.0485986496499171E-2,2.0211915667965642E-2,1.0999390421066504E-2,3.0642419126194021E-2,1.1558446462293141E-2,4.1344897056165154E-2,1.2120312872390814E-2,1.0612305171344948E-2,1.2496836300327184E-2,2.3109141471672132E-2,297,87,384,340,99,439,382,112,494,202,59,261,"W",300,2013,32850,6150,3750,2400,{"$f":"SUM(AJ20:AM20)","v":45150},10]
[2,14,25.2,{"$f":"INDEX(BFnames,MATCH(B21,Lookups!A$2:A$145,0),2)","v":"John Senden"},null,null,{"$f":"INDEX(BFnames,MATCH(B21,Lookups!A$2:A$145,0),4)","v":68.07692307692308},1.4689265536723162E-2,1.3295595353758299E-2,1.3120718669318916E-2,1.3696370990131148E-2,2.6271107801753721E-2,1.4296822540349547E-2,3.9601797734386643E-2,1.4937960904404725E-2,5.3097753637154355E-2,1.5565678783265303E-2,1.3838725356135652E-2,1.2513868625563317E-2,2.6352593981698969E-2,387,87,474,443,99,542,498,112,610,264,59,323,"M",350,2014,26500,6150,4050,1850,{"$f":"SUM(AJ21:AM21)","v":38550},10]
[2,15,null,{"$f":"INDEX(BFnames,MATCH(B22,Lookups!A$2:A$145,0),2)","v":"Matthew Griffin"},null,null,{"$f":"INDEX(BFnames,MATCH(B22,Lookups!A$2:A$145,0),4)","v":85.597826086956516},1.1682539682539683E-2,1.0574137960468874E-2,1.0463528205892303E-2,1.092260018566815E-2,2.1039544499331007E-2,1.1449788730136579E-2,3.1872467233263639E-2,1.202242566488344E-2,4.2967748181429635E-2,1.259605388963889E-2,1.1051705412730517E-2,1.2576719622235751E-2,2.3628425034966268E-2,309,87,396,354,100,454,398,112,510,211,59,270,"M",325,2015,28100,6775,4025,2700,{"$f":"SUM(AJ22:AM22)","v":41600},13]
[2,16,null,{"$f":"INDEX(BFnames,MATCH(B23,Lookups!A$2:A$145,0),2)","v":"Nick Voke"},null,null,{"$f":"INDEX(BFnames,MATCH(B23,Lookups!A$2:A$145,0),4)","v":83},1.2048192771084338E-2,1.0905099062165058E-2,1.0787456553591444E-2,1.1260740415340337E-2,2.1679738402994982E-2,1.1798184340293774E-2,3.2822586154967588E-2,1.2380814427993176E-2,4.421926959307497E-2,1.2962939095690594E-2,1.139187182856111E-2,1.2645666707178618E-2,2.4037538535739728E-2,319,88,407,365,100,465,410,113,523,217,60,277,null,null,2018,11150,3650,3325,1950,{"$f":"SUM(AJ23:AM23)","v":20075},12]
[2,17,601,{"$f":"INDEX(BFnames,MATCH(B24,Lookups!A$2:A$145,0),2)","v":"Rhein Gibson"},null,null,{"$f":"INDEX(BFnames,MATCH(B24,Lookups!A$2:A$145,0),4)","v":251.06060606060606},3.983101991550996E-3,3.6051981087833543E-3,3.5923414282332923E-3,3.7499501486418802E-3,7.3016337971789167E-3,3.9735729243179103E-3,1.1201760623595224E-2,4.22535015652762E-3,1.5314731403344033E-2,4.4895343653414618E-3,3.8084649280724016E-3,1.2657630597973658E-2,1.6466095526046061E-2,107,88,195,122,100,222,137,113,250,73,60,133]
[2,18,null,{"$f":"INDEX(BFnames,MATCH(B25,Lookups!A$2:A$145,0),2)","v":"Anthony Quayle"},null,null,{"$f":"INDEX(BFnames,MATCH(B25,Lookups!A$2:A$145,0),4)","v":159.42528735632186},6.2725306416726743E-3,5.6774131454862195E-3,5.6455285167422683E-3,5.8932178144690539E-3,1.1438190014312335E-2,6.2247003077085814E-3,1.7482038960069793E-2,6.5942969626362957E-3,2.3801084043254126E-2,6.9773201978088444E-3,5.9784281837274101E-3,1.2739589182360024E-2,1.8718017366087435E-2,167,88,255,191,101,292,215,114,329,114,60,174]
[2,19,null,{"$f":"INDEX(BFnames,MATCH(B26,Lookups!A$2:A$145,0),2)","v":"Cameron Percy"},null,null,{"$f":"INDEX(BFnames,MATCH(B26,Lookups!A$2:A$145,0),4)","v":65.9375},1.5165876777251185E-2,1.3726987255502554E-2,1.3540577416972814E-2,1.4134650425598852E-2,2.709357194949304E-2,1.4744410211747399E-2,4.0809671910974232E-2,1.5393576009262411E-2,5.4670133259408817E-2,1.6026624010677688E-2,1.4278401199251809E-2,1.2991958037027454E-2,2.7270359236279261E-2,400,90,490,457,103,560,514,116,630,272,61,333]
[2,20,null,{"$f":"INDEX(BFnames,MATCH(B27,Lookups!A$2:A$145,0),2)","v":"Zach Murray"},null,null,{"$f":"INDEX(BFnames,MATCH(B27,Lookups!A$2:A$145,0),4)","v":107.5609756097561},9.297052154195011E-3,8.4149778023917664E-3,8.3449292378715758E-3,8.7110507898889682E-3,1.6835861774438469E-2,9.162130882312219E-3,2.5604408371797956E-2,9.6580880949811449E-3,3.4667660206289169E-2,1.0162871797289955E-2,8.8240517425685651E-3,1.376451821379529E-2,2.2588569956363855E-2,247,96,343,282,109,391,318,123,441,168,65,233,"J",250]
[2,21,1200,{"$f":"INDEX(BFnames,MATCH(B28,Lookups!A$2:A$145,0),2)","v":"Brett Coletta"},null,null,{"$f":"INDEX(BFnames,MATCH(B28,Lookups!A$2:A$145,0),4)","v":114.47368421052632},8.7356321839080469E-3,7.9068235499008266E-3,7.8449799181207463E-3,8.1891669257388271E-3,1.5839680820069695E-2,8.6200059582260073E-3,2.4111593585245367E-2,9.0949922206825674E-3,3.2679815884273024E-2,9.5801325273938021E-3,8.2976400468741055E-3,1.3910489038665912E-2,2.220812908554002E-2,232,97,329,266,111,377,299,124,423,158,66,224]
[2,22,null,{"$f":"INDEX(BFnames,MATCH(B29,Lookups!A$2:A$145,0),2)","v":"Cameron John"},null,null,{"$f":"INDEX(BFnames,MATCH(B29,Lookups!A$2:A$145,0),4)","v":73.07692307692308},1.3684210526315788E-2,1.2385896724290626E-2,1.2234133359585649E-2,1.2770888048034236E-2,2.4530628688616062E-2,1.3349648130976031E-2,3.7039190214155499E-2,1.3971334813152625E-2,4.9752230807730856E-2,1.4584934210138048E-2,1.2909671951481455E-2,1.4169273971315474E-2,2.7078945922796929E-2,361,99,460,413,113,526,465,127,592,246,67,313,"M",350,"Result"]
[2,23,84.1,{"$f":"INDEX(BFnames,MATCH(B30,Lookups!A$2:A$145,0),2)","v":"Greg Chalmers"},null,null,{"$f":"INDEX(BFnames,MATCH(B30,Lookups!A$2:A$145,0),4)","v":98.835616438356169},1.0117810117810117E-2,9.1578648950323034E-3,9.0749017395538832E-3,9.4730497662875689E-3,1.8287507082200494E-2,9.952120992863224E-3,2.7774674906574121E-2,1.0476721553645426E-2,3.7550034914334215E-2,1.1007843867954784E-2,9.5921609226925844E-3,1.4315317356871393E-2,2.3907478279563979E-2,269,100,369,307,114,421,345,128,473,183,68,251,null,null,2012,{"$f":"+AJ8-AJ19","v":-25315},{"$f":"+AK8-AK19","v":27995},-3165,-515,-1000]
[2,24,null,{"$f":"INDEX(BFnames,MATCH(B31,Lookups!A$2:A$145,0),2)","v":"Jake McLeod"},null,null,{"$f":"INDEX(BFnames,MATCH(B31,Lookups!A$2:A$145,0),4)","v":85.434782608695656},1.1704834605597963E-2,1.0594317613065186E-2,1.048328525665735E-2,1.0943224048108071E-2,2.107861054137403E-2,1.1471048597617524E-2,3.1930479533523355E-2,1.2044308143024117E-2,4.3044213732063429E-2,1.2618469869932231E-2,1.1072456149085738E-2,1.4855730174846407E-2,2.5928186323932144E-2,310,103,413,354,118,472,399,133,532,211,70,281,"M",300,2013,{"$f":"+AJ9-AJ20","v":4677.5},{"$f":"+AK9-AK20","v":-6150},-3750,4222.5,-1000]
[3,25,735,{"$f":"INDEX(BFnames,MATCH(B32,Lookups!A$2:A$145,0),2)","v":"Jordan Zunic"},null,null,{"$f":"INDEX(BFnames,MATCH(B32,Lookups!A$2:A$145,0),4)","v":132.5},7.5471698113207548E-3,6.8311186578090544E-3,6.7849582675943154E-3,7.0826383773346423E-3,1.3722239703671715E-2,7.4676875973398059E-3,2.0929142537285089E-2,7.8945586026568475E-3,2.8427965143624147E-2,8.3336966929215411E-3,7.1805830553605962E-3,1.4912023478481822E-2,2.2092606533842419E-2,201,104,305,230,119,349,259,133,392,137,71,208,null,null,2014,{"$f":"+AJ10-AJ21","v":-7725},4176.25,4398.75,-1850,-1000]
[3,26,null,{"$f":"INDEX(BFnames,MATCH(B33,Lookups!A$2:A$145,0),2)","v":"Matthew Millar"},null,null,{"$f":"INDEX(BFnames,MATCH(B33,Lookups!A$2:A$145,0),4)","v":84.954545454545453},1.1771000535045479E-2,1.0654205932323912E-2,1.0541914651423559E-2,1.1004425721726956E-2,2.1194524942064169E-2,1.1534129592490045E-2,3.2102584167062936E-2,1.2109226718300028E-2,4.3271025062759344E-2,1.2684959920380375E-2,1.1134031803469105E-2,1.5083491901917318E-2,2.6217523705386422E-2,312,105,417,356,120,476,401,135,536,212,72,284,null,null,2015,{"$f":"+AJ11-AJ22","v":6410},-1700,-4025,-1685,-1000]
[3,27,246,{"$f":"INDEX(BFnames,MATCH(B34,Lookups!A$2:A$145,0),2)","v":"Nick Cullen"},null,null,{"$f":"INDEX(BFnames,MATCH(B34,Lookups!A$2:A$145,0),4)","v":91.25},1.0958904109589041E-2,9.9191585990104081E-3,9.8218278511349073E-3,1.025274616739643E-2,1.9769333645323468E-2,1.0758535841007961E-2,2.9983829027799544E-2,1.1310023569781311E-2,4.0474790775789436E-2,1.186524003145328E-2,1.0377497387946071E-2,1.5782946373173172E-2,2.6160443761119243E-2,291,110,401,332,126,458,374,141,515,198,75,273,"G",350,2018,{"$f":"+AJ12-AJ23","v":3823.875},69.625,-2943.5,-1950,-1000]
[3,28,null,{"$f":"INDEX(BFnames,MATCH(B35,Lookups!A$2:A$145,0),2)","v":"Travis Smyth"},null,null,{"$f":"INDEX(BFnames,MATCH(B35,Lookups!A$2:A$145,0),4)","v":532.38095238095241},1.8783542039355991E-3,1.7001420094234071E-3,1.6972828920271425E-3,1.7717486938246473E-3,3.4599672502376414E-3,1.8829254611321198E-3,5.3264521318342846E-3,2.0091596406350888E-3,7.3103328079010647E-3,2.1430340172984425E-3,1.8012869809776305E-3,1.6035382112189987E-2,1.7836669093167619E-2,50,112,162,58,128,186,65,144,209,34,76,110,"J",200]
[3,29,null,{"$f":"INDEX(BFnames,MATCH(B36,Lookups!A$2:A$145,0),2)","v":"Harrison Endycott"},null,null,{"$f":"INDEX(BFnames,MATCH(B36,Lookups!A$2:A$145,0),4)","v":71.25},1.4035087719298246E-2,1.2703483819785259E-2,1.2543837388574666E-2,1.3094179887839539E-2,2.5139193520726234E-2,1.3680831097245764E-2,3.793622221967994E-2,1.4309698973244496E-2,5.0924797388964625E-2,1.4928673700139844E-2,1.3234307218016713E-2,1.6164252367331308E-2,2.9398559585348021E-2,371,113,484,423,129,552,476,145,621,252,77,329,"W",350]
[3,30,null,{"$f":"INDEX(BFnames,MATCH(B37,Lookups!A$2:A$145,0),2)","v":"Adam Bland"},null,null,{"$f":"INDEX(BFnames,MATCH(B37,Lookups!A$2:A$145,0),4)","v":195.0632911392405},5.1265412070084365E-3,4.6401514958219524E-3,4.6188534483931811E-3,4.8214988807105813E-3,9.3730915151507034E-3,5.1008669698207462E-3,1.4352722301928366E-2,5.4139058548803619E-3,1.958161757253183E-2,5.7403778561640256E-3,4.8939666192946282E-3,1.8348512609043813E-2,2.3242479228338442E-2,137,128,265,157,147,304,176,165,341,93,87,180]
[3,31,789,{"$f":"INDEX(BFnames,MATCH(B38,Lookups!A$2:A$145,0),2)","v":"Ben Eccles"},null,null,{"$f":"INDEX(BFnames,MATCH(B38,Lookups!A$2:A$145,0),4)","v":810.90909090909088},1.2331838565022423E-3,1.1161833457126343E-3,1.1149510075138432E-3,1.1638678505041667E-3,2.274908942203507E-3,1.2380128652194377E-3,3.5058213486968766E-3,1.3224102248062374E-3,4.8172975515019976E-3,1.4121973370568592E-3,1.1836559126809909E-3,1.8794773273842338E-2,1.997842918652333E-2,33,131,164,38,150,188,43,169,212,23,90,113]
[3,32,null,{"$f":"INDEX(BFnames,MATCH(B39,Lookups!A$2:A$145,0),2)","v":"Deyen Lawson"},null,null,{"$f":"INDEX(BFnames,MATCH(B39,Lookups!A$2:A$145,0),4)","v":143.89830508474577},{"$f":"IF(G39<>\"Scr\",1/G39,\"\")","v":6.9493521790341571E-3},6.2900200362099269E-3,{"$f":"(1-I39)*I39/(1-I39/92)","v":6.2508830556720933E-3},6.525131397459783E-3,{"$f":"(1-I39-K39)*(I39+K39)/(1-(I39+K39)/92)","v":1.2652685784840686E-2},6.8856328667112826E-3,{"$f":"(1-I39-K39-M39)*(I39+K39+M39)/(1-(I39+K39+M39)/92)","v":1.9316799877763087E-2},7.2863763233071846E-3,{"$f":"(1-I39-K39-M39-O39)*(I39+K39+M39+O39)/(1-(I39+K39+M39+O39)/92)","v":2.6266558783430299E-2},7.7000774751898446E-3,{"$f":"+I$7*I39+K$7*K39+M$7*M39+O$7*O39+Q$7*Q39","v":6.6172908384876036E-3},2.072212467708006E-2,{"$f":"+R39+S39","v":2.7339415515567664E-2},185,145,{"$f":"+U39+V39","v":330},212,166,378,238,187,425,126,99,225,"G",250]
[3,33,1200,{"$f":"INDEX(BFnames,MATCH(B40,Lookups!A$2:A$145,0),2)","v":"Douglas Klein"},null,null,{"$f":"INDEX(BFnames,MATCH(B40,Lookups!A$2:A$145,0),4)","v":446.05263157894734},{"$f":"IF(G40<>\"Scr\",1/G40,\"\")","v":2.2418879056047198E-3},{"$f":"IF(H40<>\"\",+H40/$H$153,0)","v":2.0291848048418046E-3},{"$f":"(1-I40)*I40/(1-I40/92)","v":2.0251118804593422E-3},{"$f":"IF(J40<>\"\",+J40/$J$153,0)","v":2.1139606991309005E-3},{"$f":"(1-I40-K40)*(I40+K40)/(1-(I40+K40)/92)","v":4.1261656678353471E-3},{"$f":"IF(L40<>\"\",+L40/$L$153,0)","v":2.2454728125772794E-3},{"$f":"(1-I40-K40-M40)*(I40+K40+M40)/(1-(I40+K40+M40)/92)","v":6.3482447042118965E-3},{"$f":"IF(N40<>\"\",+N40/$N$153,0)","v":2.3945839994220751E-3},{"$f":"(1-I40-K40-M40-O40)*(I40+K40+M40+O40)/(1-(I40+K40+M40+O40)/92)","v":8.7068889161671676E-3},{"$f":"IF(P40<>\"\",+P40/$P$153,0)","v":2.5524363421618834E-3},{"$f":"+I$7*I40+K$7*K40+M$7*M40+O$7*O40+Q$7*Q40","v":2.1488122787345905E-3},2.1514959168838492E-2,2.3663771447573083E-2,60,151,211,69,172,241,77,194,271,41,103,144,null,null,"Total",{"$f":"SUM(AJ30:AJ39)","v":-18128.625},{"$f":"SUM(AK30:AK39)","v":24390.875},-9484.75,-1777.5,-5000]
[3,34,null,{"$f":"INDEX(BFnames,MATCH(B41,Lookups!A$2:A$145,0),2)","v":"Jarryd Felton"},null,null,{"$f":"INDEX(BFnames,MATCH(B41,Lookups!A$2:A$145,0),4)","v":153.33333333333334},6.5217391304347823E-3,5.9029775358241283E-3,5.8685089319964927E-3,6.1259811689640164E-3,1.188581692249418E-2,6.4683003309300609E-3,1.8158761392940845E-2,6.8495594462528869E-3,2.4711165420730465E-2,7.2441117928965099E-3,6.2137997463206363E-3,2.2758834864147155E-2,2.8972634610467791E-2,174,160,334,199,183,382,224,206,430,119,109,228]
[3,35,null,{"$f":"INDEX(BFnames,MATCH(B42,Lookups!A$2:A$145,0),2)","v":"Mikko Ilonen"},null,null,{"$f":"INDEX(BFnames,MATCH(B42,Lookups!A$2:A$145,0),4)","v":118.07692307692308},8.4690553745928338E-3,7.665538689300388E-3,7.6074120636369143E-3,7.9411761294763718E-3,1.5365751889904326E-2,8.362092288865643E-3,2.3400399911649945E-2,8.8267270433569512E-3,3.1731298448162075E-2,9.3020733493780622E-3,8.0473995616734441E-3,2.8950416241396458E-2,3.6997815803069906E-2,225,205,430,258,234,492,290,263,553,154,140,294]
[3,36,169,{"$f":"INDEX(BFnames,MATCH(B43,Lookups!A$2:A$145,0),2)","v":"Andrew Dodt"},null,null,{"$f":"INDEX(BFnames,MATCH(B43,Lookups!A$2:A$145,0),4)","v":117.90322580645162},8.4815321477428179E-3,7.6768317064160579E-3,7.6185336809426211E-3,7.9527856914575635E-3,1.5387946672206941E-2,8.3741707617757573E-3,2.3433720422992858E-2,8.8392956772127586E-3,3.1775759310588479E-2,9.3151071117418272E-3,8.0591158550843024E-3,3.393929628837819E-2,4.1998412143462491E-2,226,242,468,258,276,534,290,311,601,154,165,319]
["4C",114,{"$f":"RANK($G44,$G$44:$G$152,1)+36","v":37},{"$f":"INDEX(BFnames,MATCH(B44,Lookups!A$2:A$145,0),2)","v":"Campbell Rawson"},null,null,{"$f":"INDEX(BFnames,MATCH(B44,Lookups!A$2:A$145,0),4)","v":110},{"$f":"IF(G44<>\"Scr\",1/G44,\"\")","v":9.0909090909090905E-3},{"$f":"IF(H44<>\"\",+H44/$H$153,0)","v":8.2283929287245428E-3},{"$f":"(1-I44)*I44/(1-I44/92)","v":8.161416427896185E-3},{"$f":"IF(J44<>\"\",+J44/$J$153,0)","v":8.519486624067641E-3},{"$f":"(1-I44-K44)*(I44+K44)/(1-(I44+K44)/92)","v":1.6470386388140572E-2},{"$f":"IF(L44<>\"\",+L44/$L$153,0)","v":8.9632379852103341E-3},{"$f":"(1-I44-K44-M44)*(I44+K44+M44)/(1-(I44+K44+M44)/92)","v":2.5057058635772806E-2},{"$f":"IF(N44<>\"\",+N44/$N$153,0)","v":9.451625524452929E-3},{"$f":"(1-I44-K44-M44-O44)*(I44+K44+M44+O44)/(1-(I44+K44+M44+O44)/92)","v":3.393929628837819E-2},{"$f":"IF(P44<>\"\",+P44/$P$153,0)","v":9.9493509229230653E-3},{"$f":"+I$7*I44+K$7*K44+M$7*M44+O$7*O44+Q$7*Q44","v":8.6308580543445201E-3},null,null,{"$f":"ROUND(+$R44*U$6,0)","v":242},null,null,{"$f":"ROUND(+$R44*X$6,0)","v":276},null,null,{"$f":"ROUND(+$R44*AA$6,0)","v":311},null,null,{"$f":"ROUND(+$R44*AD$6,0)","v":165}]
["4C",103,{"$f":"RANK($G45,$G$44:$G$152,1)+36","v":38},{"$f":"INDEX(BFnames,MATCH(B45,Lookups!A$2:A$145,0),2)","v":"David Micheluzzi"},null,null,{"$f":"INDEX(BFnames,MATCH(B45,Lookups!A$2:A$145,0),4)","v":130},{"$f":"IF(G45<>\"Scr\",1/G45,\"\")","v":7.6923076923076927E-3},{"$f":"IF(H45<>\"\",+H45/$H$153,0)","v":6.9624863243053824E-3},{"$f":"(1-I45)*I45/(1-I45/92)","v":6.9145333948392486E-3},{"$f":"IF(J45<>\"\",+J45/$J$153,0)","v":7.2178984235689988E-3},{"$f":"(1-I45-K45)*(I45+K45)/(1-(I45+K45)/92)","v":1.3981456462711163E-2},{"$f":"IF(L45<>\"\",+L45/$L$153,0)","v":7.6087542029598448E-3},{"$f":"(1-I45-K45-M45)*(I45+K45+M45)/(1-(I45+K45+M45)/92)","v":2.1319421633749478E-2},{"$f":"IF(N45<>\"\",+N45/$N$153,0)","v":8.041773482241197E-3},{"$f":"(1-I45-K45-M45-O45)*(I45+K45+M45+O45)/(1-(I45+K45+M45+O45)/92)","v":2.8950416241396458E-2},{"$f":"IF(P45<>\"\",+P45/$P$153,0)","v":8.4868539436681652E-3},{"$f":"+I$7*I45+K$7*K45+M$7*M45+O$7*O45+Q$7*Q45","v":7.3171980221659475E-3},null,null,{"$f":"ROUND(+$R45*U$6,0)","v":205},null,null,{"$f":"ROUND(+$R45*X$6,0)","v":234},null,null,{"$f":"ROUND(+$R45*AA$6,0)","v":263},null,null,{"$f":"ROUND(+$R45*AD$6,0)","v":140}]
["4D",121,{"$f":"RANK($G46,$G$44:$G$152,1)+36","v":39},{"$f":"INDEX(BFnames,MATCH(B46,Lookups!A$2:A$145,0),2)","v":"Aaron Pike"},null,null,{"$f":"INDEX(BFnames,MATCH(B46,Lookups!A$2:A$145,0),4)","v":167},{"$f":"IF(G46<>\"Scr\",1/G46,\"\")","v":5.9880239520958087E-3},{"$f":"IF(H46<>\"\",+H46/$H$153,0)","v":5.4198995338904177E-3},{"$f":"(1-I46)*I46/(1-I46/92)","v":5.390841807943845E-3},{"$f":"IF(J46<>\"\",+J46/$J$153,0)","v":5.6273570992236609E-3},{"$f":"(1-I46-K46)*(I46+K46)/(1-(I46+K46)/92)","v":1.0926526799057692E-2},{"$f":"IF(L46<>\"\",+L46/$L$153,0)","v":5.9462515173445921E-3},{"$f":"(1-I46-K46-M46)*(I46+K46+M46)/(1-(I46+K46+M46)/92)","v":1.6707814965870694E-2},{"$f":"IF(N46<>\"\",+N46/$N$153,0)","v":6.3022564892676863E-3},{"$f":"(1-I46-K46-M46-O46)*(I46+K46+M46+O46)/(1-(I46+K46+M46+O46)/92)","v":2.2758834864147155E-2},{"$f":"IF(P46<>\"\",+P46/$P$153,0)","v":6.6717834316969721E-3},{"$f":"+I$7*I46+K$7*K46+M$7*M46+O$7*O46+Q$7*Q46","v":5.7095189736229325E-3},null,null,{"$f":"ROUND(+$R46*U$6,0)","v":160},null,null,{"$f":"ROUND(+$R46*X$6,0)","v":183},null,null,{"$f":"ROUND(+$R46*AA$6,0)","v":206},null,null,{"$f":"ROUND(+$R46*AD$6,0)","v":109}]
["4D",119,{"$f":"RANK($G47,$G$44:$G$152,1)+36","v":40},{"$f":"INDEX(BFnames,MATCH(B47,Lookups!A$2:A$145,0),2)","v":"Dylan Perry"},null,null,{"$f":"INDEX(BFnames,MATCH(B47,Lookups!A$2:A$145,0),4)","v":177},{"$f":"IF(G47<>\"Scr\",1/G47,\"\")","v":5.6497175141242938E-3},{"$f":"IF(H47<>\"\",+H47/$H$153,0)","v":5.1136905206762692E-3},{"$f":"(1-I47)*I47/(1-I47/92)","v":5.0878234894431544E-3},{"$f":"IF(J47<>\"\",+J47/$J$153,0)","v":5.3110442956654236E-3},{"$f":"(1-I47-K47)*(I47+K47)/(1-(I47+K47)/92)","v":1.0317228789635121E-2},{"$f":"IF(L47<>\"\",+L47/$L$153,0)","v":5.6146695535904314E-3},{"$f":"(1-I47-K47-M47)*(I47+K47+M47)/(1-(I47+K47+M47)/92)","v":1.5784893837120256E-2},{"$f":"IF(N47<>\"\",+N47/$N$153,0)","v":5.9541268454673972E-3},{"$f":"(1-I47-K47-M47-O47)*(I47+K47+M47+O47)/(1-(I47+K47+M47+O47)/92)","v":2.1514959168838492E-2},{"$f":"IF(P47<>\"\",+P47/$P$153,0)","v":6.3071395778007246E-3},{"$f":"+I$7*I47+K$7*K47+M$7*M47+O$7*O47+Q$7*Q47","v":5.3894825361441431E-3},null,null,{"$f":"ROUND(+$R47*U$6,0)","v":151},null,null,{"$f":"ROUND(+$R47*X$6,0)","v":172},null,null,{"$f":"ROUND(+$R47*AA$6,0)","v":194},null,null,{"$f":"ROUND(+$R47*AD$6,0)","v":103}]
["4D",122,{"$f":"RANK($G48,$G$44:$G$152,1)+36","v":41},{"$f":"INDEX(BFnames,MATCH(B48,Lookups!A$2:A$145,0),2)","v":"Aron Price"},null,null,{"$f":"INDEX(BFnames,MATCH(B48,Lookups!A$2:A$145,0),4)","v":184},{"$f":"IF(G48<>\"Scr\",1/G48,\"\")","v":5.434782608695652E-3},{"$f":"IF(H48<>\"\",+H48/$H$153,0)","v":4.9191479465201067E-3},{"$f":"(1-I48)*I48/(1-I48/92)","v":4.8952116720704019E-3},{"$f":"IF(J48<>\"\",+J48/$J$153,0)","v":5.1099819168195591E-3},{"$f":"(1-I48-K48)*(I48+K48)/(1-(I48+K48)/92)","v":9.9296288690176523E-3},{"$f":"IF(L48<>\"\",+L48/$L$153,0)","v":5.4037364127598958E-3},{"$f":"(1-I48-K48-M48)*(I48+K48+M48)/(1-(I48+K48+M48)/92)","v":1.5197242229898149E-2},{"$f":"IF(N48<>\"\",+N48/$N$153,0)","v":5.7324622434467634E-3},{"$f":"(1-I48-K48-M48-O48)*(I48+K48+M48+O48)/(1-(I48+K48+M48+O48)/92)","v":2.072212467708006E-2},{"$f":"IF(P48<>\"\",+P48/$P$153,0)","v":6.074719066919268E-3},{"$f":"+I$7*I48+K$7*K48+M$7*M48+O$7*O48+Q$7*Q48","v":5.1859985571420701E-3},null,null,{"$f":"ROUND(+$R48*U$6,0)","v":145},null,null,{"$f":"ROUND(+$R48*X$6,0)","v":166},null,null,{"$f":"ROUND(+$R48*AA$6,0)","v":187},null,null,{"$f":"ROUND(+$R48*AD$6,0)","v":99}]
["4B",76,{"$f":"RANK($G49,$G$44:$G$152,1)+36","v":42},{"$f":"INDEX(BFnames,MATCH(B49,Lookups!A$2:A$145,0),2)","v":"Jake Higginbottom"},null,null,{"$f":"INDEX(BFnames,MATCH(B49,Lookups!A$2:A$145,0),4)","v":203.47826086956522},{"$f":"IF(G49<>\"Scr\",1/G49,\"\")","v":4.9145299145299144E-3},{"$f":"IF(H49<>\"\",+H49/$H$153,0)","v":4.4482551516395498E-3},{"$f":"(1-I49)*I49/(1-I49/92)","v":4.4286823071898965E-3},{"$f":"IF(J49<>\"\",+J49/$J$153,0)","v":4.622984259127585E-3},{"$f":"(1-I49-K49)*(I49+K49)/(1-(I49+K49)/92)","v":8.9898384282397509E-3},{"$f":"IF(L49<>\"\",+L49/$L$153,0)","v":4.8922993900690744E-3},{"$f":"(1-I49-K49-M49)*(I49+K49+M49)/(1-(I49+K49+M49)/92)","v":1.3770648460907843E-2},{"$f":"IF(N49<>\"\",+N49/$N$153,0)","v":5.1943452092005999E-3},{"$f":"(1-I49-K49-M49-O49)*(I49+K49+M49+O49)/(1-(I49+K49+M49+O49)/92)","v":1.8794773273842338E-2},{"$f":"IF(P49<>\"\",+P49/$P$153,0)","v":5.509713378537724E-3},{"$f":"+I$7*I49+K$7*K49+M$7*M49+O$7*O49+Q$7*Q49","v":4.6929588596505379E-3},null,null,{"$f":"ROUND(+$R49*U$6,0)","v":131},null,null,{"$f":"ROUND(+$R49*X$6,0)","v":150},null,null,{"$f":"ROUND(+$R49*AA$6,0)","v":169},null,null,{"$f":"ROUND(+$R49*AD$6,0)","v":90}]
["4A",37,{"$f":"RANK($G50,$G$44:$G$152,1)+36","v":43},{"$f":"INDEX(BFnames,MATCH(B50,Lookups!A$2:A$145,0),2)","v":"Jamie Arnold"},null,null,{"$f":"INDEX(BFnames,MATCH(B50,Lookups!A$2:A$145,0),4)","v":208.57142857142856},{"$f":"IF(G50<>\"Scr\",1/G50,\"\")","v":4.7945205479452057E-3},{"$f":"IF(H50<>\"\",+H50/$H$153,0)","v":4.3396318870670535E-3},{"$f":"(1-I50)*I50/(1-I50/92)","v":4.3210033034965867E-3},{"$f":"IF(J50<>\"\",+J50/$J$153,0)","v":4.5105809968062974E-3},{"$f":"(1-I50-K50)*(I50+K50)/(1-(I50+K50)/92)","v":8.7727305346183004E-3},{"$f":"IF(L50<>\"\",+L50/$L$153,0)","v":4.7741485663338155E-3},{"$f":"(1-I50-K50-M50)*(I50+K50+M50)/(1-(I50+K50+M50)/92)","v":1.3440728674690166E-2},{"$f":"IF(N50<>\"\",+N50/$N$153,0)","v":5.0698981095723449E-3},{"$f":"(1-I50-K50-M50-O50)*(I50+K50+M50+O50)/(1-(I50+K50+M50+O50)/92)","v":1.8348512609043813E-2},{"$f":"IF(P50<>\"\",+P50/$P$153,0)","v":5.3788914569677746E-3},{"$f":"+I$7*I50+K$7*K50+M$7*M50+O$7*O50+Q$7*Q50","v":4.5791254563756316E-3},null,null,{"$f":"ROUND(+$R50*U$6,0)","v":128},null,null,{"$f":"ROUND(+$R50*X$6,0)","v":147},null,null,{"$f":"ROUND(+$R50*AA$6,0)","v":165},null,null,{"$f":"ROUND(+$R50*AD$6,0)","v":87}]
["4D",120,{"$f":"RANK($G51,$G$44:$G$152,1)+36","v":44},{"$f":"INDEX(BFnames,MATCH(B51,Lookups!A$2:A$145,0),2)","v":"Blake Proverbs"},null,null,{"$f":"INDEX(BFnames,MATCH(B51,Lookups!A$2:A$145,0),4)","v":237.55555555555554},{"$f":"IF(G51<>\"Scr\",1/G51,\"\")","v":4.2095416276894298E-3},{"$f":"IF(H51<>\"\",+H51/$H$153,0)","v":3.8101538818696434E-3},{"$f":"(1-I51)*I51/(1-I51/92)","v":3.7957938109892011E-3},{"$f":"IF(J51<>\"\",+J51/$J$153,0)","v":3.9623287068047876E-3},{"$f":"(1-I51-K51)*(I51+K51)/(1-(I51+K51)/92)","v":7.7127227009408392E-3},{"$f":"IF(L51<>\"\",+L51/$L$153,0)","v":4.1972888463773029E-3},{"$f":"(1-I51-K51-M51)*(I51+K51+M51)/(1-(I51+K51+M51)/92)","v":1.1828034907652727E-2},{"$f":"IF(N51<>\"\",+N51/$N$153,0)","v":4.4615833910244913E-3},{"$f":"(1-I51-K51-M51-O51)*(I51+K51+M51+O51)/(1-(I51+K51+M51+O51)/92)","v":1.6164252367331308E-2},{"$f":"IF(P51<>\"\",+P51/$P$153,0)","v":4.7385725927481855E-3},{"$f":"+I$7*I51+K$7*K51+M$7*M51+O$7*O51+Q$7*Q51","v":4.0237057227283032E-3},null,null,{"$f":"ROUND(+$R51*U$6,0)","v":113},null,null,{"$f":"ROUND(+$R51*X$6,0)","v":129},null,null,{"$f":"ROUND(+$R51*AA$6,0)","v":145},null,null,{"$f":"ROUND(+$R51*AD$6,0)","v":77}]
["4A",45,{"$f":"RANK($G52,$G$44:$G$152,1)+36","v":45},{"$f":"INDEX(BFnames,MATCH(B52,Lookups!A$2:A$145,0),2)","v":"Mark Brown"},null,null,{"$f":"INDEX(BFnames,MATCH(B52,Lookups!A$2:A$145,0),4)","v":239.51219512195121},{"$f":"IF(G52<>\"Scr\",1/G52,\"\")","v":4.1751527494908354E-3},{"$f":"IF(H52<>\"\",+H52/$H$153,0)","v":3.7790277096280745E-3},{"$f":"(1-I52)*I52/(1-I52/92)","v":3.7649013077453936E-3},{"$f":"IF(J52<>\"\",+J52/$J$153,0)","v":3.9300808402126606E-3},{"$f":"(1-I52-K52)*(I52+K52)/(1-(I52+K52)/92)","v":7.6503192510938949E-3},{"$f":"IF(L52<>\"\",+L52/$L$153,0)","v":4.1633286854621315E-3},{"$f":"(1-I52-K52-M52)*(I52+K52+M52)/(1-(I52+K52+M52)/92)","v":1.1732996591849039E-2},{"$f":"IF(N52<>\"\",+N52/$N$153,0)","v":4.4257345476104151E-3},{"$f":"(1-I52-K52-M52-O52)*(I52+K52+M52+O52)/(1-(I52+K52+M52+O52)/92)","v":1.6035382112189987E-2},{"$f":"IF(P52<>\"\",+P52/$P$153,0)","v":4.7007941019676707E-3},{"$f":"+I$7*I52+K$7*K52+M$7*M52+O$7*O52+Q$7*Q52","v":3.9910263381957804E-3},null,null,{"$f":"ROUND(+$R52*U$6,0)","v":112},null,null,{"$f":"ROUND(+$R52*X$6,0)","v":128},null,null,{"$f":"ROUND(+$R52*AA$6,0)","v":144},null,null,{"$f":"ROUND(+$R52*AD$6,0)","v":76}]
["4C",107,{"$f":"RANK($G53,$G$44:$G$152,1)+36","v":46},{"$f":"INDEX(BFnames,MATCH(B53,Lookups!A$2:A$145,0),2)","v":"Jason Norris"},null,null,{"$f":"INDEX(BFnames,MATCH(B53,Lookups!A$2:A$145,0),4)","v":243.4375},{"$f":"IF(G53<>\"Scr\",1/G53,\"\")","v":4.1078305519897306E-3},{"$f":"IF(H53<>\"\",+H53/$H$153,0)","v":3.7180928253030027E-3},{"$f":"(1-I53)*I53/(1-I53/92)","v":3.7044183216017753E-3},{"$f":"IF(J53<>\"\",+J53/$J$153,0)","v":3.8669442516086343E-3},{"$f":"(1-I53-K53)*(I53+K53)/(1-(I53+K53)/92)","v":7.528124953658873E-3},{"$f":"IF(L53<>\"\",+L53/$L$153,0)","v":4.0968301503012134E-3},{"$f":"(1-I53-K53-M53)*(I53+K53+M53)/(1-(I53+K53+M53)/92)","v":1.1546867389774031E-2},{"$f":"IF(N53<>\"\",+N53/$N$153,0)","v":4.3555258474293557E-3},{"$f":"(1-I53-K53-M53-O53)*(I53+K53+M53+O53)/(1-(I53+K53+M53+O53)/92)","v":1.5782946373173172E-2},{"$f":"IF(P53<>\"\",+P53/$P$153,0)","v":4.626792221326859E-3},{"$f":"+I$7*I53+K$7*K53+M$7*M53+O$7*O53+Q$7*Q53","v":3.9270417001102849E-3},null,null,{"$f":"ROUND(+$R53*U$6,0)","v":110},null,null,{"$f":"ROUND(+$R53*X$6,0)","v":126},null,null,{"$f":"ROUND(+$R53*AA$6,0)","v":141},null,null,{"$f":"ROUND(+$R53*AD$6,0)","v":75}]
["4A",58,{"$f":"RANK($G54,$G$44:$G$152,1)+36","v":47},{"$f":"INDEX(BFnames,MATCH(B54,Lookups!A$2:A$145,0),2)","v":"Ryan Chisnall"},null,null,{"$f":"INDEX(BFnames,MATCH(B54,Lookups!A$2:A$145,0),4)","v":255},{"$f":"IF(G54<>\"Scr\",1/G54,\"\")","v":3.9215686274509803E-3},{"$f":"IF(H54<>\"\",+H54/$H$153,0)","v":3.5495028319988222E-3},{"$f":"(1-I54)*I54/(1-I54/92)","v":3.5370403261515693E-3},{"$f":"IF(J54<>\"\",+J54/$J$153,0)","v":3.6922227916758683E-3},{"$f":"(1-I54-K54)*(I54+K54)/(1-(I54+K54)/92)","v":7.1898489783788983E-3},{"$f":"IF(L54<>\"\",+L54/$L$153,0)","v":3.9127392613772741E-3},{"$f":"(1-I54-K54-M54)*(I54+K54+M54)/(1-(I54+K54+M54)/92)","v":1.1031380288876477E-2},{"$f":"IF(N54<>\"\",+N54/$N$153,0)","v":4.1610819938553466E-3},{"$f":"(1-I54-K54-M54-O54)*(I54+K54+M54+O54)/(1-(I54+K54+M54+O54)/92)","v":1.5083491901917318E-2},{"$f":"IF(P54<>\"\",+P54/$P$153,0)","v":4.4217461906136324E-3},{"$f":"+I$7*I54+K$7*K54+M$7*M54+O$7*O54+Q$7*Q54","v":3.7499512821837799E-3},null,null,{"$f":"ROUND(+$R54*U$6,0)","v":105},null,null,{"$f":"ROUND(+$R54*X$6,0)","v":120},null,null,{"$f":"ROUND(+$R54*AA$6,0)","v":135},null,null,{"$f":"ROUND(+$R54*AD$6,0)","v":72}]
["4B",87,{"$f":"RANK($G55,$G$44:$G$152,1)+36","v":48},{"$f":"INDEX(BFnames,MATCH(B55,Lookups!A$2:A$145,0),2)","v":"Takumi Kanaya"},null,null,{"$f":"INDEX(BFnames,MATCH(B55,Lookups!A$2:A$145,0),4)","v":258},{"$f":"IF(G55<>\"Scr\",1/G55,\"\")","v":3.875968992248062E-3},{"$f":"IF(H55<>\"\",+H55/$H$153,0)","v":3.5082295432546499E-3},{"$f":"(1-I55)*I55/(1-I55/92)","v":3.4960551835534395E-3},{"$f":"IF(J55<>\"\",+J55/$J$153,0)","v":3.6494394859549664E-3},{"$f":"(1-I55-K55)*(I55+K55)/(1-(I55+K55)/92)","v":7.1069897324115899E-3},{"$f":"IF(L55<>\"\",+L55/$L$153,0)","v":3.8676469895035049E-3},{"$f":"(1-I55-K55-M55)*(I55+K55+M55)/(1-(I55+K55+M55)/92)","v":1.0905065292694723E-2},{"$f":"IF(N55<>\"\",+N55/$N$153,0)","v":4.1134354580273863E-3},{"$f":"(1-I55-K55-M55-O55)*(I55+K55+M55+O55)/(1-(I55+K55+M55+O55)/92)","v":1.4912023478481822E-2},{"$f":"IF(P55<>\"\",+P55/$P$153,0)","v":4.3714799887906945E-3},{"$f":"+I$7*I55+K$7*K55+M$7*M55+O$7*O55+Q$7*Q55","v":3.7065829472098469E-3},null,null,{"$f":"ROUND(+$R55*U$6,0)","v":104},null,null,{"$f":"ROUND(+$R55*X$6,0)","v":119},null,null,{"$f":"ROUND(+$R55*AA$6,0)","v":133},null,null,{"$f":"ROUND(+$R55*AD$6,0)","v":71}]
["4C",112,{"$f":"RANK($G56,$G$44:$G$152,1)+36","v":49},{"$f":"INDEX(BFnames,MATCH(B56,Lookups!A$2:A$145,0),2)","v":"Callan OReilly"},null,null,{"$f":"INDEX(BFnames,MATCH(B56,Lookups!A$2:A$145,0),4)","v":259},{"$f":"IF(G56<>\"Scr\",1/G56,\"\")","v":3.8610038610038611E-3},{"$f":"IF(H56<>\"\",+H56/$H$153,0)","v":3.4946842554428562E-3},{"$f":"(1-I56)*I56/(1-I56/92)","v":3.482603726532519E-3},{"$f":"IF(J56<>\"\",+J56/$J$153,0)","v":3.6353978659523101E-3},{"$f":"(1-I56-K56)*(I56+K56)/(1-(I56+K56)/92)","v":7.0797927405943139E-3},{"$f":"IF(L56<>\"\",+L56/$L$153,0)","v":3.8528462978624396E-3},{"$f":"(1-I56-K56-M56)*(I56+K56+M56)/(1-(I56+K56+M56)/92)","v":1.0863600595505023E-2},{"$f":"IF(N56<>\"\",+N56/$N$153,0)","v":4.0977948037902454E-3},{"$f":"(1-I56-K56-M56-O56)*(I56+K56+M56+O56)/(1-(I56+K56+M56+O56)/92)","v":1.4855730174846407E-2},{"$f":"IF(P56<>\"\",+P56/$P$153,0)","v":4.3549775301739788E-3},{"$f":"+I$7*I56+K$7*K56+M$7*M56+O$7*O56+Q$7*Q56","v":3.6923488938022052E-3},null,null,{"$f":"ROUND(+$R56*U$6,0)","v":103},null,null,{"$f":"ROUND(+$R56*X$6,0)","v":118},null,null,{"$f":"ROUND(+$R56*AA$6,0)","v":133},null,null,{"$f":"ROUND(+$R56*AD$6,0)","v":70}]
["4B",69,{"$f":"RANK($G57,$G$44:$G$152,1)+36","v":50},{"$f":"INDEX(BFnames,MATCH(B57,Lookups!A$2:A$145,0),2)","v":"Peter Fowler"},null,null,{"$f":"INDEX(BFnames,MATCH(B57,Lookups!A$2:A$145,0),4)","v":269},{"$f":"IF(G57<>\"Scr\",1/G57,\"\")","v":3.7174721189591076E-3},{"$f":"IF(H57<>\"\",+H57/$H$153,0)","v":3.3647703426011141E-3},{"$f":"(1-I57)*I57/(1-I57/92)","v":3.3535713152872695E-3},{"$f":"IF(J57<>\"\",+J57/$J$153,0)","v":3.5007043465875021E-3},{"$f":"(1-I57-K57)*(I57+K57)/(1-(I57+K57)/92)","v":6.8188488011965316E-3},{"$f":"IF(L57<>\"\",+L57/$L$153,0)","v":3.7108397550587604E-3},{"$f":"(1-I57-K57-M57)*(I57+K57+M57)/(1-(I57+K57+M57)/92)","v":1.0465659148567496E-2},{"$f":"IF(N57<>\"\",+N57/$N$153,0)","v":3.9476896541082804E-3},{"$f":"(1-I57-K57-M57-O57)*(I57+K57+M57+O57)/(1-(I57+K57+M57+O57)/92)","v":1.4315317356871393E-2},{"$f":"IF(P57<>\"\",+P57/$P$153,0)","v":4.19655477669101E-3},{"$f":"+I$7*I57+K$7*K57+M$7*M57+O$7*O57+Q$7*Q57","v":3.5557987935333512E-3},null,null,{"$f":"ROUND(+$R57*U$6,0)","v":100},null,null,{"$f":"ROUND(+$R57*X$6,0)","v":114},null,null,{"$f":"ROUND(+$R57*AA$6,0)","v":128},null,null,{"$f":"ROUND(+$R57*AD$6,0)","v":68}]
["4C",102,{"$f":"RANK($G58,$G$44:$G$152,1)+36","v":51},{"$f":"INDEX(BFnames,MATCH(B58,Lookups!A$2:A$145,0),2)","v":"David McKenzie"},null,null,{"$f":"INDEX(BFnames,MATCH(B58,Lookups!A$2:A$145,0),4)","v":271.83333333333337},{"$f":"IF(G58<>\"Scr\",1/G58,\"\")","v":3.6787247087676266E-3},{"$f":"IF(H58<>\"\",+H58/$H$153,0)","v":3.329699161838257E-3},{"$f":"(1-I58)*I58/(1-I58/92)","v":3.3187323781605402E-3},{"$f":"IF(J58<>\"\",+J58/$J$153,0)","v":3.4643369021040435E-3},{"$f":"(1-I58-K58)*(I58+K58)/(1-(I58+K58)/92)","v":6.7483754934093186E-3},{"$f":"IF(L58<>\"\",+L58/$L$153,0)","v":3.6724879511352898E-3},{"$f":"(1-I58-K58-M58)*(I58+K58+M58)/(1-(I58+K58+M58)/92)","v":1.0358154301757995E-2},{"$f":"IF(N58<>\"\",+N58/$N$153,0)","v":3.90713838395016E-3},{"$f":"(1-I58-K58-M58-O58)*(I58+K58+M58+O58)/(1-(I58+K58+M58+O58)/92)","v":1.4169273971315474E-2},{"$f":"IF(P58<>\"\",+P58/$P$153,0)","v":4.1537419593443772E-3},{"$f":"+I$7*I58+K$7*K58+M$7*M58+O$7*O58+Q$7*Q58","v":3.5189267536115359E-3},null,null,{"$f":"ROUND(+$R58*U$6,0)","v":99},null,null,{"$f":"ROUND(+$R58*X$6,0)","v":113},null,null,{"$f":"ROUND(+$R58*AA$6,0)","v":127},null,null,{"$f":"ROUND(+$R58*AD$6,0)","v":67}]
["4C",98,{"$f":"RANK($G59,$G$44:$G$152,1)+36","v":52},{"$f":"INDEX(BFnames,MATCH(B59,Lookups!A$2:A$145,0),2)","v":"Jordan Mullaney"},null,null,{"$f":"INDEX(BFnames,MATCH(B59,Lookups!A$2:A$145,0),4)","v":277},{"$f":"IF(G59<>\"Scr\",1/G59,\"\")","v":3.6101083032490976E-3},{"$f":"IF(H59<>\"\",+H59/$H$153,0)","v":3.2675928597823093E-3},{"$f":"(1-I59)*I59/(1-I59/92)","v":3.2570313776901596E-3},{"$f":"IF(J59<>\"\",+J59/$J$153,0)","v":3.3999288605780333E-3},{"$f":"(1-I59-K59)*(I59+K59)/(1-(I59+K59)/92)","v":6.6235459031229399E-3},{"$f":"IF(L59<>\"\",+L59/$L$153,0)","v":3.6045552810105162E-3},{"$f":"(1-I59-K59-M59)*(I59+K59+M59)/(1-(I59+K59+M59)/92)","v":1.0167696689397899E-2},{"$f":"IF(N59<>\"\",+N59/$N$153,0)","v":3.8352969896159072E-3},{"$f":"(1-I59-K59-M59-O59)*(I59+K59+M59+O59)/(1-(I59+K59+M59+O59)/92)","v":1.3910489038665912E-2},{"$f":"IF(P59<>\"\",+P59/$P$153,0)","v":4.0778788039442706E-3},{"$f":"+I$7*I59+K$7*K59+M$7*M59+O$7*O59+Q$7*Q59","v":3.453621593867741E-3},null,null,{"$f":"ROUND(+$R59*U$6,0)","v":97},null,null,{"$f":"ROUND(+$R59*X$6,0)","v":111},null,null,{"$f":"ROUND(+$R59*AA$6,0)","v":124},null,null,{"$f":"ROUND(+$R59*AD$6,0)","v":66}]
["4B",80,{"$f":"RANK($G60,$G$44:$G$152,1)+36","v":53},{"$f":"INDEX(BFnames,MATCH(B60,Lookups!A$2:A$145,0),2)","v":"Daniel Hillier"},null,null,{"$f":"INDEX(BFnames,MATCH(B60,Lookups!A$2:A$145,0),4)","v":280},{"$f":"IF(G60<>\"Scr\",1/G60,\"\")","v":3.5714285714285713E-3},{"$f":"IF(H60<>\"\",+H60/$H$153,0)","v":3.2325829362846417E-3},{"$f":"(1-I60)*I60/(1-I60/92)","v":3.2222465631844299E-3},{"$f":"IF(J60<>\"\",+J60/$J$153,0)","v":3.363617913266326E-3},{"$f":"(1-I60-K60)*(I60+K60)/(1-(I60+K60)/92)","v":6.5531608313494707E-3},{"$f":"IF(L60<>\"\",+L60/$L$153,0)","v":3.5662514954134779E-3},{"$f":"(1-I60-K60-M60)*(I60+K60+M60)/(1-(I60+K60+M60)/92)","v":1.0060288181205317E-2},{"$f":"IF(N60<>\"\",+N60/$N$153,0)","v":3.7947820587801275E-3},{"$f":"(1-I60-K60-M60-O60)*(I60+K60+M60+O60)/(1-(I60+K60+M60+O60)/92)","v":1.376451821379529E-2},{"$f":"IF(P60<>\"\",+P60/$P$153,0)","v":4.0350872578613405E-3},{"$f":"+I$7*I60+K$7*K60+M$7*M60+O$7*O60+Q$7*Q60","v":3.4168029322814509E-3},null,null,{"$f":"ROUND(+$R60*U$6,0)","v":96},null,null,{"$f":"ROUND(+$R60*X$6,0)","v":109},null,null,{"$f":"ROUND(+$R60*AA$6,0)","v":123},null,null,{"$f":"ROUND(+$R60*AD$6,0)","v":65}]
["4A",48,{"$f":"RANK($G61,$G$44:$G$152,1)+36","v":54},{"$f":"INDEX(BFnames,MATCH(B61,Lookups!A$2:A$145,0),2)","v":"Zach Bauchou"},null,null,{"$f":"INDEX(BFnames,MATCH(B61,Lookups!A$2:A$145,0),4)","v":297},{"$f":"IF(G61<>\"Scr\",1/G61,\"\")","v":3.3670033670033669E-3},{"$f":"IF(H61<>\"\",+H61/$H$153,0)","v":3.0475529365646455E-3},{"$f":"(1-I61)*I61/(1-I61/92)","v":3.0383660052856749E-3},{"$f":"IF(J61<>\"\",+J61/$J$153,0)","v":3.1716698651199382E-3},{"$f":"(1-I61-K61)*(I61+K61)/(1-(I61+K61)/92)","v":6.1809619039842152E-3},{"$f":"IF(L61<>\"\",+L61/$L$153,0)","v":3.3636996253361036E-3},{"$f":"(1-I61-K61-M61)*(I61+K61+M61)/(1-(I61+K61+M61)/92)","v":9.4920787405853701E-3},{"$f":"IF(N61<>\"\",+N61/$N$153,0)","v":3.5804511219266139E-3},{"$f":"(1-I61-K61-M61-O61)*(I61+K61+M61+O61)/(1-(I61+K61+M61+O61)/92)","v":1.2991958037027454E-2},{"$f":"IF(P61<>\"\",+P61/$P$153,0)","v":3.8086101900274161E-3},{"$f":"+I$7*I61+K$7*K61+M$7*M61+O$7*O61+Q$7*Q61","v":3.2221475972339271E-3},null,null,{"$f":"ROUND(+$R61*U$6,0)","v":90},null,null,{"$f":"ROUND(+$R61*X$6,0)","v":103},null,null,{"$f":"ROUND(+$R61*AA$6,0)","v":116},null,null,{"$f":"ROUND(+$R61*AD$6,0)","v":61}]
["4B",86,{"$f":"RANK($G62,$G$44:$G$152,1)+36","v":55},{"$f":"INDEX(BFnames,MATCH(B62,Lookups!A$2:A$145,0),2)","v":"Rick Kulacz"},null,null,{"$f":"INDEX(BFnames,MATCH(B62,Lookups!A$2:A$145,0),4)","v":303},{"$f":"IF(G62<>\"Scr\",1/G62,\"\")","v":3.3003300330033004E-3},{"$f":"IF(H62<>\"\",+H62/$H$153,0)","v":2.9872053536623751E-3},{"$f":"(1-I62)*I62/(1-I62/92)","v":2.9783786646710385E-3},{"$f":"IF(J62<>\"\",+J62/$J$153,0)","v":3.1090506677667745E-3},{"$f":"(1-I62-K62)*(I62+K62)/(1-(I62+K62)/92)","v":6.0594932081020408E-3},{"$f":"IF(L62<>\"\",+L62/$L$153,0)","v":3.2975959649065574E-3},{"$f":"(1-I62-K62-M62)*(I62+K62+M62)/(1-(I62+K62+M62)/92)","v":9.3065577966993558E-3},{"$f":"IF(N62<>\"\",+N62/$N$153,0)","v":3.5104718592349309E-3},{"$f":"(1-I62-K62-M62-O62)*(I62+K62+M62+O62)/(1-(I62+K62+M62+O62)/92)","v":1.2739589182360024E-2},{"$f":"IF(P62<>\"\",+P62/$P$153,0)","v":3.7346279166247044E-3},{"$f":"+I$7*I62+K$7*K62+M$7*M62+O$7*O62+Q$7*Q62","v":3.1586366850089686E-3},null,null,{"$f":"ROUND(+$R62*U$6,0)","v":88},null,null,{"$f":"ROUND(+$R62*X$6,0)","v":101},null,null,{"$f":"ROUND(+$R62*AA$6,0)","v":114},null,null,{"$f":"ROUND(+$R62*AD$6,0)","v":60}]
["4B",81,{"$f":"RANK($G63,$G$44:$G$152,1)+36","v":56},{"$f":"INDEX(BFnames,MATCH(B63,Lookups!A$2:A$145,0),2)","v":"Tim Hart"},null,null,{"$f":"INDEX(BFnames,MATCH(B63,Lookups!A$2:A$145,0),4)","v":305},{"$f":"IF(G63<>\"Scr\",1/G63,\"\")","v":3.2786885245901639E-3},{"$f":"IF(H63<>\"\",+H63/$H$153,0)","v":2.9676171218350812E-3},{"$f":"(1-I63)*I63/(1-I63/92)","v":2.958905815013691E-3},{"$f":"IF(J63<>\"\",+J63/$J$153,0)","v":3.0887234753420377E-3},{"$f":"(1-I63-K63)*(I63+K63)/(1-(I63+K63)/92)","v":6.0200576348725752E-3},{"$f":"IF(L63<>\"\",+L63/$L$153,0)","v":3.2761349973488441E-3},{"$f":"(1-I63-K63-M63)*(I63+K63+M63)/(1-(I63+K63+M63)/92)","v":9.2463184399033185E-3},{"$f":"IF(N63<>\"\",+N63/$N$153,0)","v":3.4877493262135489E-3},{"$f":"(1-I63-K63-M63-O63)*(I63+K63+M63+O63)/(1-(I63+K63+M63+O63)/92)","v":1.2657630597973658E-2},{"$f":"IF(P63<>\"\",+P63/$P$153,0)","v":3.7106016460067958E-3},{"$f":"+I$7*I63+K$7*K63+M$7*M63+O$7*O63+Q$7*Q63","v":3.1380191262354875E-3},null,null,{"$f":"ROUND(+$R63*U$6,0)","v":88},null,null,{"$f":"ROUND(+$R63*X$6,0)","v":100},null,null,{"$f":"ROUND(+$R63*AA$6,0)","v":113},null,null,{"$f":"ROUND(+$R63*AD$6,0)","v":60}]
["4D",141,{"$f":"RANK($G64,$G$44:$G$152,1)+36","v":57},{"$f":"INDEX(BFnames,MATCH(B64,Lookups!A$2:A$145,0),2)","v":"Jack Wilson"},null,null,{"$f":"INDEX(BFnames,MATCH(B64,Lookups!A$2:A$145,0),4)","v":305.29411764705884},{"$f":"IF(G64<>\"Scr\",1/G64,\"\")","v":3.2755298651252407E-3},{"$f":"IF(H64<>\"\",+H64/$H$153,0)","v":2.9647581458024843E-3},{"$f":"(1-I64)*I64/(1-I64/92)","v":2.9560636159576964E-3},{"$f":"IF(J64<>\"\",+J64/$J$153,0)","v":3.0857565789638897E-3},{"$f":"(1-I64-K64)*(I64+K64)/(1-(I64+K64)/92)","v":6.0143015356795941E-3},{"$f":"IF(L64<>\"\",+L64/$L$153,0)","v":3.2730025093963867E-3},{"$f":"(1-I64-K64-M64)*(I64+K64+M64)/(1-(I64+K64+M64)/92)","v":9.2375254151927863E-3},{"$f":"IF(N64<>\"\",+N64/$N$153,0)","v":3.4844325611454985E-3},{"$f":"(1-I64-K64-M64-O64)*(I64+K64+M64+O64)/(1-(I64+K64+M64+O64)/92)","v":1.2645666707178618E-2},{"$f":"IF(P64<>\"\",+P64/$P$153,0)","v":3.7070944151287016E-3},{"$f":"+I$7*I64+K$7*K64+M$7*M64+O$7*O64+Q$7*Q64","v":3.1350098118933462E-3},null,null,{"$f":"ROUND(+$R64*U$6,0)","v":88},null,null,{"$f":"ROUND(+$R64*X$6,0)","v":100},null,null,{"$f":"ROUND(+$R64*AA$6,0)","v":113},null,null,{"$f":"ROUND(+$R64*AD$6,0)","v":60}]
["4D",138,{"$f":"RANK($G65,$G$44:$G$152,1)+36","v":58},{"$f":"INDEX(BFnames,MATCH(B65,Lookups!A$2:A$145,0),2)","v":"Peter Wilson"},null,null,{"$f":"INDEX(BFnames,MATCH(B65,Lookups!A$2:A$145,0),4)","v":307},{"$f":"IF(G65<>\"Scr\",1/G65,\"\")","v":3.2573289902280132E-3},{"$f":"IF(H65<>\"\",+H65/$H$153,0)","v":2.9482841112693802E-3},{"$f":"(1-I65)*I65/(1-I65/92)","v":2.9396859389093323E-3},{"$f":"IF(J65<>\"\",+J65/$J$153,0)","v":3.0686603553145343E-3},{"$f":"(1-I65-K65)*(I65+K65)/(1-(I65+K65)/92)","v":5.9811320212962583E-3},{"$f":"IF(L65<>\"\",+L65/$L$153,0)","v":3.2549515514974409E-3},{"$f":"(1-I65-K65-M65)*(I65+K65+M65)/(1-(I65+K65+M65)/92)","v":9.1868538270223014E-3},{"$f":"IF(N65<>\"\",+N65/$N$153,0)","v":3.4653190297818065E-3},{"$f":"(1-I65-K65-M65-O65)*(I65+K65+M65+O65)/(1-(I65+K65+M65+O65)/92)","v":1.2576719622235751E-2},{"$f":"IF(P65<>\"\",+P65/$P$153,0)","v":3.6868824832907376E-3},{"$f":"+I$7*I65+K$7*K65+M$7*M65+O$7*O65+Q$7*Q65","v":3.1176689786717613E-3},null,null,{"$f":"ROUND(+$R65*U$6,0)","v":87},null,null,{"$f":"ROUND(+$R65*X$6,0)","v":100},null,null,{"$f":"ROUND(+$R65*AA$6,0)","v":112},null,null,{"$f":"ROUND(+$R65*AD$6,0)","v":59}]
["4D",123,{"$f":"RANK($G66,$G$44:$G$152,1)+36","v":59},{"$f":"INDEX(BFnames,MATCH(B66,Lookups!A$2:A$145,0),2)","v":"Terry Pilkadaris"},null,null,{"$f":"INDEX(BFnames,MATCH(B66,Lookups!A$2:A$145,0),4)","v":308.57142857142856},{"$f":"IF(G66<>\"Scr\",1/G66,\"\")","v":3.2407407407407411E-3},{"$f":"IF(H66<>\"\",+H66/$H$153,0)","v":2.9332697014434715E-3},{"$f":"(1-I66)*I66/(1-I66/92)","v":2.9247588814608804E-3},{"$f":"IF(J66<>\"\",+J66/$J$153,0)","v":3.0530783950761006E-3},{"$f":"(1-I66-K66)*(I66+K66)/(1-(I66+K66)/92)","v":5.9508989520370226E-3},{"$f":"IF(L66<>\"\",+L66/$L$153,0)","v":3.2384986166112866E-3},{"$f":"(1-I66-K66-M66)*(I66+K66+M66)/(1-(I66+K66+M66)/92)","v":9.1406654514418987E-3},{"$f":"IF(N66<>\"\",+N66/$N$153,0)","v":3.4478965846371275E-3},{"$f":"(1-I66-K66-M66-O66)*(I66+K66+M66+O66)/(1-(I66+K66+M66+O66)/92)","v":1.2513868625563317E-2},{"$f":"IF(P66<>\"\",+P66/$P$153,0)","v":3.6684576280304462E-3},{"$f":"+I$7*I66+K$7*K66+M$7*M66+O$7*O66+Q$7*Q66","v":3.1018638023138953E-3},null,null,{"$f":"ROUND(+$R66*U$6,0)","v":87},null,null,{"$f":"ROUND(+$R66*X$6,0)","v":99},null,null,{"$f":"ROUND(+$R66*AA$6,0)","v":112},null,null,{"$f":"ROUND(+$R66*AD$6,0)","v":59}]
["4A",46,{"$f":"RANK($G67,$G$44:$G$152,1)+36","v":60},{"$f":"INDEX(BFnames,MATCH(B67,Lookups!A$2:A$145,0),2)","v":"Adam Blyth"},null,null,{"$f":"INDEX(BFnames,MATCH(B67,Lookups!A$2:A$145,0),4)","v":309},{"$f":"IF(G67<>\"Scr\",1/G67,\"\")","v":3.2362459546925568E-3},{"$f":"IF(H67<>\"\",+H67/$H$153,0)","v":2.9292013662126203E-3},{"$f":"(1-I67)*I67/(1-I67/92)","v":2.9207141386105931E-3},{"$f":"IF(J67<>\"\",+J67/$J$153,0)","v":3.0488561950553993E-3},{"$f":"(1-I67-K67)*(I67+K67)/(1-(I67+K67)/92)","v":5.9427065395161313E-3},{"$f":"IF(L67<>\"\",+L67/$L$153,0)","v":3.2340402790005406E-3},{"$f":"(1-I67-K67-M67)*(I67+K67+M67)/(1-(I67+K67+M67)/92)","v":9.1281491088965293E-3},{"$f":"IF(N67<>\"\",+N67/$N$153,0)","v":3.4431753687755931E-3},{"$f":"(1-I67-K67-M67-O67)*(I67+K67+M67+O67)/(1-(I67+K67+M67+O67)/92)","v":1.2496836300327184E-2},{"$f":"IF(P67<>\"\",+P67/$P$153,0)","v":3.6634645786941325E-3},{"$f":"+I$7*I67+K$7*K67+M$7*M67+O$7*O67+Q$7*Q67","v":3.0975810733205049E-3},null,null,{"$f":"ROUND(+$R67*U$6,0)","v":87},null,null,{"$f":"ROUND(+$R67*X$6,0)","v":99},null,null,{"$f":"ROUND(+$R67*AA$6,0)","v":112},null,null,{"$f":"ROUND(+$R67*AD$6,0)","v":59}]
["4D",140,{"$f":"RANK($G68,$G$44:$G$152,1)+36","v":61},{"$f":"INDEX(BFnames,MATCH(B68,Lookups!A$2:A$145,0),2)","v":"Shae Wools Cobb"},null,null,{"$f":"INDEX(BFnames,MATCH(B68,Lookups!A$2:A$145,0),4)","v":318},{"$f":"IF(G68<>\"Scr\",1/G68,\"\")","v":3.1446540880503146E-3},{"$f":"IF(H68<>\"\",+H68/$H$153,0)","v":2.8462994407537729E-3},{"$f":"(1-I68)*I68/(1-I68/92)","v":2.838285831240535E-3},{"$f":"IF(J68<>\"\",+J68/$J$153,0)","v":2.9628114663875389E-3},{"$f":"(1-I68-K68)*(I68+K68)/(1-(I68+K68)/92)","v":5.7757298316876912E-3},{"$f":"IF(L68<>\"\",+L68/$L$153,0)","v":3.1431710100603234E-3},{"$f":"(1-I68-K68-M68)*(I68+K68+M68)/(1-(I68+K68+M68)/92)","v":8.8730019745366668E-3},{"$f":"IF(N68<>\"\",+N68/$N$153,0)","v":3.3469328208109318E-3},{"$f":"(1-I68-K68-M68-O68)*(I68+K68+M68+O68)/(1-(I68+K68+M68+O68)/92)","v":1.2149568295595624E-2},{"$f":"IF(P68<>\"\",+P68/$P$153,0)","v":3.561662490223585E-3},{"$f":"+I$7*I68+K$7*K68+M$7*M68+O$7*O68+Q$7*Q68","v":3.0102986616292234E-3},null,null,{"$f":"ROUND(+$R68*U$6,0)","v":84},null,null,{"$f":"ROUND(+$R68*X$6,0)","v":96},null,null,{"$f":"ROUND(+$R68*AA$6,0)","v":108},null,null,{"$f":"ROUND(+$R68*AD$6,0)","v":57}]
["4D",144,{"$f":"RANK($G69,$G$44:$G$152,1)+36","v":62},{"$f":"INDEX(BFnames,MATCH(B69,Lookups!A$2:A$145,0),2)","v":"Josh Younger"},null,null,{"$f":"INDEX(BFnames,MATCH(B69,Lookups!A$2:A$145,0),4)","v":323.24324324324323},{"$f":"IF(G69<>\"Scr\",1/G69,\"\")","v":3.0936454849498328E-3},{"$f":"IF(H69<>\"\",+H69/$H$153,0)","v":2.8001303695575994E-3},{"$f":"(1-I69)*I69/(1-I69/92)","v":2.7923746287428319E-3},{"$f":"IF(J69<>\"\",+J69/$J$153,0)","v":2.9148859771014998E-3},{"$f":"(1-I69-K69)*(I69+K69)/(1-(I69+K69)/92)","v":5.6827079431729152E-3},{"$f":"IF(L69<>\"\",+L69/$L$153,0)","v":3.0925481949700836E-3},{"$f":"(1-I69-K69-M69)*(I69+K69+M69)/(1-(I69+K69+M69)/92)","v":8.730827188952137E-3},{"$f":"IF(N69<>\"\",+N69/$N$153,0)","v":3.2933039072222509E-3},{"$f":"(1-I69-K69-M69-O69)*(I69+K69+M69+O69)/(1-(I69+K69+M69+O69)/92)","v":1.1956010019726565E-2},{"$f":"IF(P69<>\"\",+P69/$P$153,0)","v":3.5049206180794456E-3},{"$f":"+I$7*I69+K$7*K69+M$7*M69+O$7*O69+Q$7*Q69","v":2.961680366894719E-3},null,null,{"$f":"ROUND(+$R69*U$6,0)","v":83},null,null,{"$f":"ROUND(+$R69*X$6,0)","v":95},null,null,{"$f":"ROUND(+$R69*AA$6,0)","v":107},null,null,{"$f":"ROUND(+$R69*AD$6,0)","v":56}]
["4A",42,{"$f":"RANK($G70,$G$44:$G$152,1)+36","v":63},{"$f":"INDEX(BFnames,MATCH(B70,Lookups!A$2:A$145,0),2)","v":"Dawson Armstrong"},null,null,{"$f":"INDEX(BFnames,MATCH(B70,Lookups!A$2:A$145,0),4)","v":327},{"$f":"IF(G70<>\"Scr\",1/G70,\"\")","v":3.0581039755351682E-3},{"$f":"IF(H70<>\"\",+H70/$H$153,0)","v":2.7679609240357787E-3},{"$f":"(1-I70)*I70/(1-I70/92)","v":2.7603823666905985E-3},{"$f":"IF(J70<>\"\",+J70/$J$153,0)","v":2.8814901013934483E-3},{"$f":"(1-I70-K70)*(I70+K70)/(1-(I70+K70)/92)","v":5.617879706108617E-3},{"$f":"IF(L70<>\"\",+L70/$L$153,0)","v":3.0572684569435769E-3},{"$f":"(1-I70-K70-M70)*(I70+K70+M70)/(1-(I70+K70+M70)/92)","v":8.6317294100391687E-3},{"$f":"IF(N70<>\"\",+N70/$N$153,0)","v":3.2559238176353106E-3},{"$f":"(1-I70-K70-M70-O70)*(I70+K70+M70+O70)/(1-(I70+K70+M70+O70)/92)","v":1.1821075544743192E-2},{"$f":"IF(P70<>\"\",+P70/$P$153,0)","v":3.4653643929944346E-3},{"$f":"+I$7*I70+K$7*K70+M$7*M70+O$7*O70+Q$7*Q70","v":2.927800270008005E-3},null,null,{"$f":"ROUND(+$R70*U$6,0)","v":82},null,null,{"$f":"ROUND(+$R70*X$6,0)","v":94},null,null,{"$f":"ROUND(+$R70*AA$6,0)","v":105},null,null,{"$f":"ROUND(+$R70*AD$6,0)","v":56}]
["4B",74,{"$f":"RANK($G71,$G$44:$G$152,1)+36","v":64},{"$f":"INDEX(BFnames,MATCH(B71,Lookups!A$2:A$145,0),2)","v":"Daniel Gale"},null,null,{"$f":"INDEX(BFnames,MATCH(B71,Lookups!A$2:A$145,0),4)","v":336.36363636363637},{"$f":"IF(G71<>\"Scr\",1/G71,\"\")","v":2.972972972972973E-3},{"$f":"IF(H71<>\"\",+H71/$H$153,0)","v":2.6909068766909992E-3},{"$f":"(1-I71)*I71/(1-I71/92)","v":2.6837443936789784E-3},{"$f":"IF(J71<>\"\",+J71/$J$153,0)","v":2.8014897495260383E-3},{"$f":"(1-I71-K71)*(I71+K71)/(1-(I71+K71)/92)","v":5.462556319929336E-3},{"$f":"IF(L71<>\"\",+L71/$L$153,0)","v":2.9727409636483332E-3},{"$f":"(1-I71-K71-M71)*(I71+K71+M71)/(1-(I71+K71+M71)/92)","v":8.394251410375593E-3},{"$f":"IF(N71<>\"\",+N71/$N$153,0)","v":3.1663461399141185E-3},{"$f":"(1-I71-K71-M71-O71)*(I71+K71+M71+O71)/(1-(I71+K71+M71+O71)/92)","v":1.1497645953869488E-2},{"$f":"IF(P71<>\"\",+P71/$P$153,0)","v":3.3705505680076795E-3},{"$f":"+I$7*I71+K$7*K71+M$7*M71+O$7*O71+Q$7*Q71","v":2.8466350991845626E-3},null,null,{"$f":"ROUND(+$R71*U$6,0)","v":80},null,null,{"$f":"ROUND(+$R71*X$6,0)","v":91},null,null,{"$f":"ROUND(+$R71*AA$6,0)","v":102},null,null,{"$f":"ROUND(+$R71*AD$6,0)","v":54}]
["4B",82,{"$f":"RANK($G72,$G$44:$G$152,1)+36","v":65},{"$f":"INDEX(BFnames,MATCH(B72,Lookups!A$2:A$145,0),2)","v":"Mark Hensby"},null,null,{"$f":"INDEX(BFnames,MATCH(B72,Lookups!A$2:A$145,0),4)","v":348},{"$f":"IF(G72<>\"Scr\",1/G72,\"\")","v":2.8735632183908046E-3},{"$f":"IF(H72<>\"\",+H72/$H$153,0)","v":2.6009287993094821E-3},{"$f":"(1-I72)*I72/(1-I72/92)","v":2.5942373102831495E-3},{"$f":"IF(J72<>\"\",+J72/$J$153,0)","v":2.7080556738987224E-3},{"$f":"(1-I72-K72)*(I72+K72)/(1-(I72+K72)/92)","v":5.2811039103177566E-3},{"$f":"IF(L72<>\"\",+L72/$L$153,0)","v":2.8739939705899596E-3},{"$f":"(1-I72-K72-M72)*(I72+K72+M72)/(1-(I72+K72+M72)/92)","v":8.1167392543511959E-3},{"$f":"IF(N72<>\"\",+N72/$N$153,0)","v":3.0616674138372476E-3},{"$f":"(1-I72-K72-M72-O72)*(I72+K72+M72+O72)/(1-(I72+K72+M72+O72)/92)","v":1.1119562879200776E-2},{"$f":"IF(P72<>\"\",+P72/$P$153,0)","v":3.259714999823408E-3},{"$f":"+I$7*I72+K$7*K72+M$7*M72+O$7*O72+Q$7*Q72","v":2.7518319225446177E-3},null,null,{"$f":"ROUND(+$R72*U$6,0)","v":77},null,null,{"$f":"ROUND(+$R72*X$6,0)","v":88},null,null,{"$f":"ROUND(+$R72*AA$6,0)","v":99},null,null,{"$f":"ROUND(+$R72*AD$6,0)","v":52}]
["4C",109,{"$f":"RANK($G73,$G$44:$G$152,1)+36","v":66},{"$f":"INDEX(BFnames,MATCH(B73,Lookups!A$2:A$145,0),2)","v":"Keita Nakajima"},null,null,{"$f":"INDEX(BFnames,MATCH(B73,Lookups!A$2:A$145,0),4)","v":349},{"$f":"IF(G73<>\"Scr\",1/G73,\"\")","v":2.8653295128939827E-3},{"$f":"IF(H73<>\"\",+H73/$H$153,0)","v":2.5934762812598842E-3},{"$f":"(1-I73)*I73/(1-I73/92)","v":2.5868230844766156E-3},{"$f":"IF(J73<>\"\",+J73/$J$153,0)","v":2.7003161597905245E-3},{"$f":"(1-I73-K73)*(I73+K73)/(1-(I73+K73)/92)","v":5.2660712188155323E-3},{"$f":"IF(L73<>\"\",+L73/$L$153,0)","v":2.8658131308502369E-3},{"$f":"(1-I73-K73-M73)*(I73+K73+M73)/(1-(I73+K73+M73)/92)","v":8.0937442540367933E-3},{"$f":"IF(N73<>\"\",+N73/$N$153,0)","v":3.052993605188529E-3},{"$f":"(1-I73-K73-M73-O73)*(I73+K73+M73+O73)/(1-(I73+K73+M73+O73)/92)","v":1.1088228186546591E-2},{"$f":"IF(P73<>\"\",+P73/$P$153,0)","v":3.250529192002602E-3},{"$f":"+I$7*I73+K$7*K73+M$7*M73+O$7*O73+Q$7*Q73","v":2.7439785805375904E-3},null,null,{"$f":"ROUND(+$R73*U$6,0)","v":77},null,null,{"$f":"ROUND(+$R73*X$6,0)","v":88},null,null,{"$f":"ROUND(+$R73*AA$6,0)","v":99},null,null,{"$f":"ROUND(+$R73*AD$6,0)","v":52}]
["4C",95,{"$f":"RANK($G74,$G$44:$G$152,1)+36","v":67},{"$f":"INDEX(BFnames,MATCH(B74,Lookups!A$2:A$145,0),2)","v":"Troy Moses"},null,null,{"$f":"INDEX(BFnames,MATCH(B74,Lookups!A$2:A$145,0),4)","v":355},{"$f":"IF(G74<>\"Scr\",1/G74,\"\")","v":2.8169014084507044E-3},{"$f":"IF(H74<>\"\",+H74/$H$153,0)","v":2.5496428793230978E-3},{"$f":"(1-I74)*I74/(1-I74/92)","v":2.5432126818599812E-3},{"$f":"IF(J74<>\"\",+J74/$J$153,0)","v":2.6547924146116016E-3},{"$f":"(1-I74-K74)*(I74+K74)/(1-(I74+K74)/92)","v":5.1776420461516455E-3},{"$f":"IF(L74<>\"\",+L74/$L$153,0)","v":2.8176896867036934E-3},{"$f":"(1-I74-K74-M74)*(I74+K74+M74)/(1-(I74+K74+M74)/92)","v":7.958464445742516E-3},{"$f":"IF(N74<>\"\",+N74/$N$153,0)","v":3.0019655053782875E-3},{"$f":"(1-I74-K74-M74-O74)*(I74+K74+M74+O74)/(1-(I74+K74+M74+O74)/92)","v":1.0903866493351821E-2},{"$f":"IF(P74<>\"\",+P74/$P$153,0)","v":3.1964833105926462E-3},{"$f":"+I$7*I74+K$7*K74+M$7*M74+O$7*O74+Q$7*Q74","v":2.6977840002236119E-3},null,null,{"$f":"ROUND(+$R74*U$6,0)","v":76},null,null,{"$f":"ROUND(+$R74*X$6,0)","v":86},null,null,{"$f":"ROUND(+$R74*AA$6,0)","v":97},null,null,{"$f":"ROUND(+$R74*AD$6,0)","v":51}]
["4A",63,{"$f":"RANK($G75,$G$44:$G$152,1)+36","v":68},{"$f":"INDEX(BFnames,MATCH(B75,Lookups!A$2:A$145,0),2)","v":"Charlie Dann"},null,null,{"$f":"INDEX(BFnames,MATCH(B75,Lookups!A$2:A$145,0),4)","v":366},{"$f":"IF(G75<>\"Scr\",1/G75,\"\")","v":2.7322404371584699E-3},{"$f":"IF(H75<>\"\",+H75/$H$153,0)","v":2.4730142681959008E-3},{"$f":"(1-I75)*I75/(1-I75/92)","v":2.4669647820937356E-3},{"$f":"IF(J75<>\"\",+J75/$J$153,0)","v":2.5751992498820779E-3},{"$f":"(1-I75-K75)*(I75+K75)/(1-(I75+K75)/92)","v":5.023004680094389E-3},{"$f":"IF(L75<>\"\",+L75/$L$153,0)","v":2.733535527796086E-3},{"$f":"(1-I75-K75-M75)*(I75+K75+M75)/(1-(I75+K75+M75)/92)","v":7.7218465740981719E-3},{"$f":"IF(N75<>\"\",+N75/$N$153,0)","v":2.9127122714818487E-3},{"$f":"(1-I75-K75-M75-O75)*(I75+K75+M75+O75)/(1-(I75+K75+M75+O75)/92)","v":1.0581319830961611E-2},{"$f":"IF(P75<>\"\",+P75/$P$153,0)","v":3.1019283172931331E-3},{"$f":"+I$7*I75+K$7*K75+M$7*M75+O$7*O75+Q$7*Q75","v":2.6170126122887793E-3},null,null,{"$f":"ROUND(+$R75*U$6,0)","v":73},null,null,{"$f":"ROUND(+$R75*X$6,0)","v":84},null,null,{"$f":"ROUND(+$R75*AA$6,0)","v":94},null,null,{"$f":"ROUND(+$R75*AD$6,0)","v":50}]
["4B",64,{"$f":"RANK($G76,$G$44:$G$152,1)+36","v":69},{"$f":"INDEX(BFnames,MATCH(B76,Lookups!A$2:A$145,0),2)","v":"Andrew Evans"},null,null,{"$f":"INDEX(BFnames,MATCH(B76,Lookups!A$2:A$145,0),4)","v":367},{"$f":"IF(G76<>\"Scr\",1/G76,\"\")","v":2.7247956403269754E-3},{"$f":"IF(H76<>\"\",+H76/$H$153,0)","v":2.4662758096994542E-3},{"$f":"(1-I76)*I76/(1-I76/92)","v":2.4602592463502152E-3},{"$f":"IF(J76<>\"\",+J76/$J$153,0)","v":2.5681995185757741E-3},{"$f":"(1-I76-K76)*(I76+K76)/(1-(I76+K76)/92)","v":5.009403513818126E-3},{"$f":"IF(L76<>\"\",+L76/$L$153,0)","v":2.7261337287527833E-3},{"$f":"(1-I76-K76-M76)*(I76+K76+M76)/(1-(I76+K76+M76)/92)","v":7.7010316203500453E-3},{"$f":"IF(N76<>\"\",+N76/$N$153,0)","v":2.9048607853598809E-3},{"$f":"(1-I76-K76-M76-O76)*(I76+K76+M76+O76)/(1-(I76+K76+M76+O76)/92)","v":1.0552940987536084E-2},{"$f":"IF(P76<>\"\",+P76/$P$153,0)","v":3.0936090206987624E-3},{"$f":"+I$7*I76+K$7*K76+M$7*M76+O$7*O76+Q$7*Q76","v":2.609908938146967E-3},null,null,{"$f":"ROUND(+$R76*U$6,0)","v":73},null,null,{"$f":"ROUND(+$R76*X$6,0)","v":84},null,null,{"$f":"ROUND(+$R76*AA$6,0)","v":94},null,null,{"$f":"ROUND(+$R76*AD$6,0)","v":50}]
["4C",100,{"$f":"RANK($G77,$G$44:$G$152,1)+36","v":70},{"$f":"INDEX(BFnames,MATCH(B77,Lookups!A$2:A$145,0),2)","v":"Antonio Murdaca"},null,null,{"$f":"INDEX(BFnames,MATCH(B77,Lookups!A$2:A$145,0),4)","v":371},{"$f":"IF(G77<>\"Scr\",1/G77,\"\")","v":2.6954177897574125E-3},{"$f":"IF(H77<>\"\",+H77/$H$153,0)","v":2.4396852349318054E-3},{"$f":"(1-I77)*I77/(1-I77/92)","v":2.433797711107355E-3},{"$f":"IF(J77<>\"\",+J77/$J$153,0)","v":2.5405770222179996E-3},{"$f":"(1-I77-K77)*(I77+K77)/(1-(I77+K77)/92)","v":4.9557275148117575E-3},{"$f":"IF(L77<>\"\",+L77/$L$153,0)","v":2.696923075046783E-3},{"$f":"(1-I77-K77-M77)*(I77+K77+M77)/(1-(I77+K77+M77)/92)","v":7.6188819354917258E-3},{"$f":"IF(N77<>\"\",+N77/$N$153,0)","v":2.8738735865222586E-3},{"$f":"(1-I77-K77-M77-O77)*(I77+K77+M77+O77)/(1-(I77+K77+M77+O77)/92)","v":1.0440931497058133E-2},{"$f":"IF(P77<>\"\",+P77/$P$153,0)","v":3.0607732860390381E-3},{"$f":"+I$7*I77+K$7*K77+M$7*M77+O$7*O77+Q$7*Q77","v":2.581875746805727E-3},null,null,{"$f":"ROUND(+$R77*U$6,0)","v":72},null,null,{"$f":"ROUND(+$R77*X$6,0)","v":83},null,null,{"$f":"ROUND(+$R77*AA$6,0)","v":93},null,null,{"$f":"ROUND(+$R77*AD$6,0)","v":49}]
["4C",96,{"$f":"RANK($G78,$G$44:$G$152,1)+36","v":71},{"$f":"INDEX(BFnames,MATCH(B78,Lookups!A$2:A$145,0),2)","v":"Taylor Macdonald"},null,null,{"$f":"INDEX(BFnames,MATCH(B78,Lookups!A$2:A$145,0),4)","v":387},{"$f":"IF(G78<>\"Scr\",1/G78,\"\")","v":2.5839793281653748E-3},{"$f":"IF(H78<>\"\",+H78/$H$153,0)","v":2.3388196955031002E-3},{"$f":"(1-I78)*I78/(1-I78/92)","v":2.3334089377478671E-3},{"$f":"IF(J78<>\"\",+J78/$J$153,0)","v":2.4357838384123816E-3},{"$f":"(1-I78-K78)*(I78+K78)/(1-(I78+K78)/92)","v":4.7520533164285127E-3},{"$f":"IF(L78<>\"\",+L78/$L$153,0)","v":2.5860829120697647E-3},{"$f":"(1-I78-K78-M78)*(I78+K78+M78)/(1-(I78+K78+M78)/92)","v":7.3070913628590726E-3},{"$f":"IF(N78<>\"\",+N78/$N$153,0)","v":2.7562649007856418E-3},{"$f":"(1-I78-K78-M78-O78)*(I78+K78+M78+O78)/(1-(I78+K78+M78+O78)/92)","v":1.0015700037326455E-2},{"$f":"IF(P78<>\"\",+P78/$P$153,0)","v":2.9361161045704277E-3},{"$f":"+I$7*I78+K$7*K78+M$7*M78+O$7*O78+Q$7*Q78","v":2.4755170315384754E-3},null,null,{"$f":"ROUND(+$R78*U$6,0)","v":69},null,null,{"$f":"ROUND(+$R78*X$6,0)","v":79},null,null,{"$f":"ROUND(+$R78*AA$6,0)","v":89},null,null,{"$f":"ROUND(+$R78*AD$6,0)","v":47}]
["4C",99,{"$f":"RANK($G79,$G$44:$G$152,1)+36","v":71},{"$f":"INDEX(BFnames,MATCH(B79,Lookups!A$2:A$145,0),2)","v":"Jack Munro"},null,null,{"$f":"INDEX(BFnames,MATCH(B79,Lookups!A$2:A$145,0),4)","v":387},{"$f":"IF(G79<>\"Scr\",1/G79,\"\")","v":2.5839793281653748E-3},{"$f":"IF(H79<>\"\",+H79/$H$153,0)","v":2.3388196955031002E-3},{"$f":"(1-I79)*I79/(1-I79/92)","v":2.3334089377478671E-3},{"$f":"IF(J79<>\"\",+J79/$J$153,0)","v":2.4357838384123816E-3},{"$f":"(1-I79-K79)*(I79+K79)/(1-(I79+K79)/92)","v":4.7520533164285127E-3},{"$f":"IF(L79<>\"\",+L79/$L$153,0)","v":2.5860829120697647E-3},{"$f":"(1-I79-K79-M79)*(I79+K79+M79)/(1-(I79+K79+M79)/92)","v":7.3070913628590726E-3},{"$f":"IF(N79<>\"\",+N79/$N$153,0)","v":2.7562649007856418E-3},{"$f":"(1-I79-K79-M79-O79)*(I79+K79+M79+O79)/(1-(I79+K79+M79+O79)/92)","v":1.0015700037326455E-2},{"$f":"IF(P79<>\"\",+P79/$P$153,0)","v":2.9361161045704277E-3},{"$f":"+I$7*I79+K$7*K79+M$7*M79+O$7*O79+Q$7*Q79","v":2.4755170315384754E-3},null,null,{"$f":"ROUND(+$R79*U$6,0)","v":69},null,null,{"$f":"ROUND(+$R79*X$6,0)","v":79},null,null,{"$f":"ROUND(+$R79*AA$6,0)","v":89},null,null,{"$f":"ROUND(+$R79*AD$6,0)","v":47}]
["4A",38,{"$f":"RANK($G80,$G$44:$G$152,1)+36","v":132},{"$f":"INDEX(BFnames,MATCH(B80,Lookups!A$2:A$145,0),2)","v":"James Anstiss"},null,null,{"$f":"INDEX(BFnames,MATCH(B80,Lookups!A$2:A$145,0),4)","v":1090},{"$f":"IF(G80<>\"Scr\",1/G80,\"\")","v":9.1743119266055051E-4},{"$f":"IF(H80<>\"\",+H80/$H$153,0)","v":8.3038827721073369E-4},{"$f":"(1-I80)*I80/(1-I80/92)","v":8.2970622141458506E-4},{"$f":"IF(J80<>\"\",+J80/$J$153,0)","v":8.6610836705821594E-4},{"$f":"(1-I80-K80)*(I80+K80)/(1-(I80+K80)/92)","v":1.6936497746131859E-3},{"$f":"IF(L80<>\"\",+L80/$L$153,0)","v":9.2168973062991047E-4},{"$f":"(1-I80-K80-M80)*(I80+K80+M80)/(1-(I80+K80+M80)/92)","v":2.6114057918210612E-3},{"$f":"IF(N80<>\"\",+N80/$N$153,0)","v":9.8503299990058512E-4},{"$f":"(1-I80-K80-M80-O80)*(I80+K80+M80+O80)/(1-(I80+K80+M80+O80)/92)","v":3.5903768035806618E-3},{"$f":"IF(P80<>\"\",+P80/$P$153,0)","v":1.0525238490751811E-3},{"$f":"+I$7*I80+K$7*K80+M$7*M80+O$7*O80+Q$7*Q80","v":8.8097430263698066E-4},null,null,{"$f":"ROUND(+$R80*U$6,0)","v":25},null,null,{"$f":"ROUND(+$R80*X$6,0)","v":28},null,null,{"$f":"ROUND(+$R80*AA$6,0)","v":32},null,null,{"$f":"ROUND(+$R80*AD$6,0)","v":17}]
["4A",39,{"$f":"RANK($G81,$G$44:$G$152,1)+36","v":139},{"$f":"INDEX(BFnames,MATCH(B81,Lookups!A$2:A$145,0),2)","v":"Sam An"},null,null,{"$f":"INDEX(BFnames,MATCH(B81,Lookups!A$2:A$145,0),4)","v":1110},{"$f":"IF(G81<>\"Scr\",1/G81,\"\")","v":9.0090090090090091E-4},{"$f":"IF(H81<>\"\",+H81/$H$153,0)","v":8.154263262699998E-4},{"$f":"(1-I81)*I81/(1-I81/92)","v":8.1476862773934814E-4},{"$f":"IF(J81<>\"\",+J81/$J$153,0)","v":8.5051540833147403E-4},{"$f":"(1-I81-K81)*(I81+K81)/(1-(I81+K81)/92)","v":1.6631964900040994E-3},{"$f":"IF(L81<>\"\",+L81/$L$153,0)","v":9.0511695383220709E-4},{"$f":"(1-I81-K81-M81)*(I81+K81+M81)/(1-(I81+K81+M81)/92)","v":2.5645200144745811E-3},{"$f":"IF(N81<>\"\",+N81/$N$153,0)","v":9.673474919427937E-4},{"$f":"(1-I81-K81-M81-O81)*(I81+K81+M81+O81)/(1-(I81+K81+M81+O81)/92)","v":3.5260214761680978E-3},{"$f":"IF(P81<>\"\",+P81/$P$153,0)","v":1.033657997209936E-3},{"$f":"+I$7*I81+K$7*K81+M$7*M81+O$7*O81+Q$7*Q81","v":8.6512092967149412E-4},null,null,{"$f":"ROUND(+$R81*U$6,0)","v":24},null,null,{"$f":"ROUND(+$R81*X$6,0)","v":28},null,null,{"$f":"ROUND(+$R81*AA$6,0)","v":31},null,null,{"$f":"ROUND(+$R81*AD$6,0)","v":17}]
["4A",40,{"$f":"RANK($G82,$G$44:$G$152,1)+36","v":116},{"$f":"INDEX(BFnames,MATCH(B82,Lookups!A$2:A$145,0),2)","v":"Robert Allenby"},null,null,{"$f":"INDEX(BFnames,MATCH(B82,Lookups!A$2:A$145,0),4)","v":794.28571428571433},{"$f":"IF(G82<>\"Scr\",1/G82,\"\")","v":1.2589928057553956E-3},{"$f":"IF(H82<>\"\",+H82/$H$153,0)","v":1.1395436250212045E-3},{"$f":"(1-I82)*I82/(1-I82/92)","v":1.1382591642171631E-3},{"$f":"IF(J82<>\"\",+J82/$J$153,0)","v":1.1881986184560226E-3},{"$f":"(1-I82-K82)*(I82+K82)/(1-(I82+K82)/92)","v":2.3223826193961229E-3},{"$f":"IF(L82<>\"\",+L82/$L$153,0)","v":1.2638481951675474E-3},{"$f":"(1-I82-K82-M82)*(I82+K82+M82)/(1-(I82+K82+M82)/92)","v":3.5788306308296713E-3},{"$f":"IF(N82<>\"\",+N82/$N$153,0)","v":1.3499496261605186E-3},{"$f":"(1-I82-K82-M82-O82)*(I82+K82+M82+O82)/(1-(I82+K82+M82+O82)/92)","v":4.9173853711239291E-3},{"$f":"IF(P82<>\"\",+P82/$P$153,0)","v":1.4415382176711049E-3},{"$f":"+I$7*I82+K$7*K82+M$7*M82+O$7*O82+Q$7*Q82","v":1.2083846280660751E-3},null,null,{"$f":"ROUND(+$R82*U$6,0)","v":34},null,null,{"$f":"ROUND(+$R82*X$6,0)","v":39},null,null,{"$f":"ROUND(+$R82*AA$6,0)","v":44},null,null,{"$f":"ROUND(+$R82*AD$6,0)","v":23}]
["4A",41,{"$f":"RANK($G83,$G$44:$G$152,1)+36","v":74},{"$f":"INDEX(BFnames,MATCH(B83,Lookups!A$2:A$145,0),2)","v":"Stephen Allan"},null,null,{"$f":"INDEX(BFnames,MATCH(B83,Lookups!A$2:A$145,0),4)","v":400},{"$f":"IF(G83<>\"Scr\",1/G83,\"\")","v":2.5000000000000001E-3},{"$f":"IF(H83<>\"\",+H83/$H$153,0)","v":2.2628080553992493E-3},{"$f":"(1-I83)*I83/(1-I83/92)","v":2.2577432859699144E-3},{"$f":"IF(J83<>\"\",+J83/$J$153,0)","v":2.3567984669491345E-3},{"$f":"(1-I83-K83)*(I83+K83)/(1-(I83+K83)/92)","v":4.5984966627659321E-3},{"$f":"IF(L83<>\"\",+L83/$L$153,0)","v":2.5025168803717306E-3},{"$f":"(1-I83-K83-M83)*(I83+K83+M83)/(1-(I83+K83+M83)/92)","v":7.0719462313234621E-3},{"$f":"IF(N83<>\"\",+N83/$N$153,0)","v":2.6675671905125034E-3},{"$f":"(1-I83-K83-M83-O83)*(I83+K83+M83+O83)/(1-(I83+K83+M83+O83)/92)","v":9.6948841808482122E-3},{"$f":"IF(P83<>\"\",+P83/$P$153,0)","v":2.8420684993808892E-3},{"$f":"+I$7*I83+K$7*K83+M$7*M83+O$7*O83+Q$7*Q83","v":2.395343878078565E-3},null,null,{"$f":"ROUND(+$R83*U$6,0)","v":67},null,null,{"$f":"ROUND(+$R83*X$6,0)","v":77},null,null,{"$f":"ROUND(+$R83*AA$6,0)","v":86},null,null,{"$f":"ROUND(+$R83*AD$6,0)","v":46}]
["4A",43,{"$f":"RANK($G84,$G$44:$G$152,1)+36","v":117},{"$f":"INDEX(BFnames,MATCH(B84,Lookups!A$2:A$145,0),2)","v":"Maverick Antcliff"},null,null,{"$f":"INDEX(BFnames,MATCH(B84,Lookups!A$2:A$145,0),4)","v":804.65116279069775},{"$f":"IF(G84<>\"Scr\",1/G84,\"\")","v":1.2427745664739883E-3},{"$f":"IF(H84<>\"\",+H84/$H$153,0)","v":1.1248641200250601E-3},{"$f":"(1-I84)*I84/(1-I84/92)","v":1.1236125389042558E-3},{"$f":"IF(J84<>\"\",+J84/$J$153,0)","v":1.172909393902484E-3},{"$f":"(1-I84-K84)*(I84+K84)/(1-(I84+K84)/92)","v":2.2925510090995855E-3},{"$f":"IF(L84<>\"\",+L84/$L$153,0)","v":1.247613735558121E-3},{"$f":"(1-I84-K84-M84)*(I84+K84+M84)/(1-(I84+K84+M84)/92)","v":3.5329536275275457E-3},{"$f":"IF(N84<>\"\",+N84/$N$153,0)","v":1.3326446319192259E-3},{"$f":"(1-I84-K84-M84-O84)*(I84+K84+M84+O84)/(1-(I84+K84+M84+O84)/92)","v":4.8544940817699649E-3},{"$f":"IF(P84<>\"\",+P84/$P$153,0)","v":1.4231015505563555E-3},{"$f":"+I$7*I84+K$7*K84+M$7*M84+O$7*O84+Q$7*Q84","v":1.1928454120817475E-3},null,null,{"$f":"ROUND(+$R84*U$6,0)","v":33},null,null,{"$f":"ROUND(+$R84*X$6,0)","v":38},null,null,{"$f":"ROUND(+$R84*AA$6,0)","v":43},null,null,{"$f":"ROUND(+$R84*AD$6,0)","v":23}]
["4A",44,{"$f":"RANK($G85,$G$44:$G$152,1)+36","v":106},{"$f":"INDEX(BFnames,MATCH(B85,Lookups!A$2:A$145,0),2)","v":"Braden Becker"},null,null,{"$f":"INDEX(BFnames,MATCH(B85,Lookups!A$2:A$145,0),4)","v":706},{"$f":"IF(G85<>\"Scr\",1/G85,\"\")","v":1.4164305949008499E-3},{"$f":"IF(H85<>\"\",+H85/$H$153,0)","v":1.2820442240222376E-3},{"$f":"(1-I85)*I85/(1-I85/92)","v":1.2804184295978453E-3},{"$f":"IF(J85<>\"\",+J85/$J$153,0)","v":1.3365949134616683E-3},{"$f":"(1-I85-K85)*(I85+K85)/(1-(I85+K85)/92)","v":2.6118562090394837E-3},{"$f":"IF(L85<>\"\",+L85/$L$153,0)","v":1.4213806666750043E-3},{"$f":"(1-I85-K85-M85)*(I85+K85+M85)/(1-(I85+K85+M85)/92)","v":4.0238747455937579E-3},{"$f":"IF(N85<>\"\",+N85/$N$153,0)","v":1.5178220957809765E-3},{"$f":"(1-I85-K85-M85-O85)*(I85+K85+M85+O85)/(1-(I85+K85+M85+O85)/92)","v":5.5272862040383949E-3},{"$f":"IF(P85<>\"\",+P85/$P$153,0)","v":1.6203314773571341E-3},{"$f":"+I$7*I85+K$7*K85+M$7*M85+O$7*O85+Q$7*Q85","v":1.3591941564529623E-3},null,null,{"$f":"ROUND(+$R85*U$6,0)","v":38},null,null,{"$f":"ROUND(+$R85*X$6,0)","v":43},null,null,{"$f":"ROUND(+$R85*AA$6,0)","v":49},null,null,{"$f":"ROUND(+$R85*AD$6,0)","v":26}]
["4A",47,{"$f":"RANK($G86,$G$44:$G$152,1)+36","v":113},{"$f":"INDEX(BFnames,MATCH(B86,Lookups!A$2:A$145,0),2)","v":"Harry Bateman"},null,null,{"$f":"INDEX(BFnames,MATCH(B86,Lookups!A$2:A$145,0),4)","v":725.16129032258073},{"$f":"IF(G86<>\"Scr\",1/G86,\"\")","v":1.3790035587188611E-3},{"$f":"IF(H86<>\"\",+H86/$H$153,0)","v":1.2481681444373083E-3},{"$f":"(1-I86)*I86/(1-I86/92)","v":1.2466271337670024E-3},{"$f":"IF(J86<>\"\",+J86/$J$153,0)","v":1.3013210740020404E-3},{"$f":"(1-I86-K86)*(I86+K86)/(1-(I86+K86)/92)","v":2.5430597960288863E-3},{"$f":"IF(L86<>\"\",+L86/$L$153,0)","v":1.3839414343576125E-3},{"$f":"(1-I86-K86-M86)*(I86+K86+M86)/(1-(I86+K86+M86)/92)","v":3.9181262943364633E-3},{"$f":"IF(N86<>\"\",+N86/$N$153,0)","v":1.4779333452455135E-3},{"$f":"(1-I86-K86-M86-O86)*(I86+K86+M86+O86)/(1-(I86+K86+M86+O86)/92)","v":5.3823977259109586E-3},{"$f":"IF(P86<>\"\",+P86/$P$153,0)","v":1.5778572226958271E-3},{"$f":"+I$7*I86+K$7*K86+M$7*M86+O$7*O86+Q$7*Q86","v":1.3233488533191727E-3},null,null,{"$f":"ROUND(+$R86*U$6,0)","v":37},null,null,{"$f":"ROUND(+$R86*X$6,0)","v":42},null,null,{"$f":"ROUND(+$R86*AA$6,0)","v":48},null,null,{"$f":"ROUND(+$R86*AD$6,0)","v":25}]
["4A",49,{"$f":"RANK($G87,$G$44:$G$152,1)+36","v":87},{"$f":"INDEX(BFnames,MATCH(B87,Lookups!A$2:A$145,0),2)","v":"Adam Burdett"},null,null,{"$f":"INDEX(BFnames,MATCH(B87,Lookups!A$2:A$145,0),4)","v":462},{"$f":"IF(G87<>\"Scr\",1/G87,\"\")","v":2.1645021645021645E-3},{"$f":"IF(H87<>\"\",+H87/$H$153,0)","v":1.9591411735058436E-3},{"$f":"(1-I87)*I87/(1-I87/92)","v":1.9553445784558574E-3},{"$f":"IF(J87<>\"\",+J87/$J$153,0)","v":2.0411324589023603E-3},{"$f":"(1-I87-K87)*(I87+K87)/(1-(I87+K87)/92)","v":3.9844446918505926E-3},{"$f":"IF(L87<>\"\",+L87/$L$153,0)","v":2.168347795269714E-3},{"$f":"(1-I87-K87-M87)*(I87+K87+M87)/(1-(I87+K87+M87)/92)","v":6.1309806210385152E-3},{"$f":"IF(N87<>\"\",+N87/$N$153,0)","v":2.3126310940983549E-3},{"$f":"(1-I87-K87-M87-O87)*(I87+K87+M87+O87)/(1-(I87+K87+M87+O87)/92)","v":8.4100961834105703E-3},{"$f":"IF(P87<>\"\",+P87/$P$153,0)","v":2.4654311484042313E-3},{"$f":"+I$7*I87+K$7*K87+M$7*M87+O$7*O87+Q$7*Q87","v":2.0748638623329075E-3},null,null,{"$f":"ROUND(+$R87*U$6,0)","v":58},null,null,{"$f":"ROUND(+$R87*X$6,0)","v":66},null,null,{"$f":"ROUND(+$R87*AA$6,0)","v":75},null,null,{"$f":"ROUND(+$R87*AD$6,0)","v":40}]
["4A",50,{"$f":"RANK($G88,$G$44:$G$152,1)+36","v":114},{"$f":"INDEX(BFnames,MATCH(B88,Lookups!A$2:A$145,0),2)","v":"Dale Brandt Richards"},null,null,{"$f":"INDEX(BFnames,MATCH(B88,Lookups!A$2:A$145,0),4)","v":726.55172413793105},{"$f":"IF(G88<>\"Scr\",1/G88,\"\")","v":1.3763644992880874E-3},{"$f":"IF(H88<>\"\",+H88/$H$153,0)","v":1.2457794704618553E-3},{"$f":"(1-I88)*I88/(1-I88/92)","v":1.2442443523866401E-3},{"$f":"IF(J88<>\"\",+J88/$J$153,0)","v":1.2988337515773829E-3},{"$f":"(1-I88-K88)*(I88+K88)/(1-(I88+K88)/92)","v":2.5382083694870401E-3},{"$f":"IF(L88<>\"\",+L88/$L$153,0)","v":1.3813012722121969E-3},{"$f":"(1-I88-K88-M88)*(I88+K88+M88)/(1-(I88+K88+M88)/92)","v":3.9106685695311236E-3},{"$f":"IF(N88<>\"\",+N88/$N$153,0)","v":1.4751202607909853E-3},{"$f":"(1-I88-K88-M88-O88)*(I88+K88+M88+O88)/(1-(I88+K88+M88+O88)/92)","v":5.3721789625877578E-3},{"$f":"IF(P88<>\"\",+P88/$P$153,0)","v":1.5748615783124863E-3},{"$f":"+I$7*I88+K$7*K88+M$7*M88+O$7*O88+Q$7*Q88","v":1.3208211834446035E-3},null,null,{"$f":"ROUND(+$R88*U$6,0)","v":37},null,null,{"$f":"ROUND(+$R88*X$6,0)","v":42},null,null,{"$f":"ROUND(+$R88*AA$6,0)","v":48},null,null,{"$f":"ROUND(+$R88*AD$6,0)","v":25}]
["4A",51,{"$f":"RANK($G89,$G$44:$G$152,1)+36","v":76},{"$f":"INDEX(BFnames,MATCH(B89,Lookups!A$2:A$145,0),2)","v":"Darren Beck"},null,null,{"$f":"INDEX(BFnames,MATCH(B89,Lookups!A$2:A$145,0),4)","v":405},{"$f":"IF(G89<>\"Scr\",1/G89,\"\")","v":2.4691358024691358E-3},{"$f":"IF(H89<>\"\",+H89/$H$153,0)","v":2.23487215348074E-3},{"$f":"(1-I89)*I89/(1-I89/92)","v":2.2299316696360824E-3},{"$f":"IF(J89<>\"\",+J89/$J$153,0)","v":2.3277666566692539E-3},{"$f":"(1-I89-K89)*(I89+K89)/(1-(I89+K89)/92)","v":4.5420463950333187E-3},{"$f":"IF(L89<>\"\",+L89/$L$153,0)","v":2.4717964605775367E-3},{"$f":"(1-I89-K89-M89)*(I89+K89+M89)/(1-(I89+K89+M89)/92)","v":6.985486110169874E-3},{"$f":"IF(N89<>\"\",+N89/$N$153,0)","v":2.6349540773845373E-3},{"$f":"(1-I89-K89-M89-O89)*(I89+K89+M89+O89)/(1-(I89+K89+M89+O89)/92)","v":9.5768988095220834E-3},{"$f":"IF(P89<>\"\",+P89/$P$153,0)","v":2.8074809271130159E-3},{"$f":"+I$7*I89+K$7*K89+M$7*M89+O$7*O89+Q$7*Q89","v":2.3658738015120881E-3},null,null,{"$f":"ROUND(+$R89*U$6,0)","v":66},null,null,{"$f":"ROUND(+$R89*X$6,0)","v":76},null,null,{"$f":"ROUND(+$R89*AA$6,0)","v":85},null,null,{"$f":"ROUND(+$R89*AD$6,0)","v":45}]
["4A",52,{"$f":"RANK($G90,$G$44:$G$152,1)+36","v":128},{"$f":"INDEX(BFnames,MATCH(B90,Lookups!A$2:A$145,0),2)","v":"Mitchell Brown"},null,null,{"$f":"INDEX(BFnames,MATCH(B90,Lookups!A$2:A$145,0),4)","v":905},{"$f":"IF(G90<>\"Scr\",1/G90,\"\")","v":1.1049723756906078E-3},{"$f":"IF(H90<>\"\",+H90/$H$153,0)","v":1.0001361570825412E-3},{"$f":"(1-I90)*I90/(1-I90/92)","v":9.9914674651926591E-4},{"$f":"IF(J90<>\"\",+J90/$J$153,0)","v":1.0429828471141781E-3},{"$f":"(1-I90-K90)*(I90+K90)/(1-(I90+K90)/92)","v":2.0389899504435522E-3},{"$f":"IF(L90<>\"\",+L90/$L$153,0)","v":1.1096249805309546E-3},{"$f":"(1-I90-K90-M90)*(I90+K90+M90)/(1-(I90+K90+M90)/92)","v":3.1429118944049771E-3},{"$f":"IF(N90<>\"\",+N90/$N$153,0)","v":1.1855192867631893E-3},{"$f":"(1-I90-K90-M90-O90)*(I90+K90+M90+O90)/(1-(I90+K90+M90+O90)/92)","v":4.3196464363594086E-3},{"$f":"IF(P90<>\"\",+P90/$P$153,0)","v":1.2663102349888919E-3},{"$f":"+I$7*I90+K$7*K90+M$7*M90+O$7*O90+Q$7*Q90","v":1.0607842233065143E-3},null,null,{"$f":"ROUND(+$R90*U$6,0)","v":30},null,null,{"$f":"ROUND(+$R90*X$6,0)","v":34},null,null,{"$f":"ROUND(+$R90*AA$6,0)","v":38},null,null,{"$f":"ROUND(+$R90*AD$6,0)","v":20}]
["4A",53,{"$f":"RANK($G91,$G$44:$G$152,1)+36","v":92},{"$f":"INDEX(BFnames,MATCH(B91,Lookups!A$2:A$145,0),2)","v":"Neven Basic"},null,null,{"$f":"INDEX(BFnames,MATCH(B91,Lookups!A$2:A$145,0),4)","v":490},{"$f":"IF(G91<>\"Scr\",1/G91,\"\")","v":2.0408163265306124E-3},{"$f":"IF(H91<>\"\",+H91/$H$153,0)","v":1.8471902493055097E-3},{"$f":"(1-I91)*I91/(1-I91/92)","v":1.8438151578946977E-3},{"$f":"IF(J91<>\"\",+J91/$J$153,0)","v":1.924709848310764E-3},{"$f":"(1-I91-K91)*(I91+K91)/(1-(I91+K91)/92)","v":3.7578269340935665E-3},{"$f":"IF(L91<>\"\",+L91/$L$153,0)","v":2.0450216724585608E-3},{"$f":"(1-I91-K91-M91)*(I91+K91+M91)/(1-(I91+K91+M91)/92)","v":5.7834508638177941E-3},{"$f":"IF(N91<>\"\",+N91/$N$153,0)","v":2.1815414410149381E-3},{"$f":"(1-I91-K91-M91-O91)*(I91+K91+M91+O91)/(1-(I91+K91+M91+O91)/92)","v":7.9351776802500627E-3},{"$f":"IF(P91<>\"\",+P91/$P$153,0)","v":2.326208142494375E-3},{"$f":"+I$7*I91+K$7*K91+M$7*M91+O$7*O91+Q$7*Q91","v":1.9566386719638619E-3},null,null,{"$f":"ROUND(+$R91*U$6,0)","v":55},null,null,{"$f":"ROUND(+$R91*X$6,0)","v":63},null,null,{"$f":"ROUND(+$R91*AA$6,0)","v":70},null,null,{"$f":"ROUND(+$R91*AD$6,0)","v":37}]
["4A",54,{"$f":"RANK($G92,$G$44:$G$152,1)+36","v":129},{"$f":"INDEX(BFnames,MATCH(B92,Lookups!A$2:A$145,0),2)","v":"Rory Bourke"},null,null,{"$f":"INDEX(BFnames,MATCH(B92,Lookups!A$2:A$145,0),4)","v":906},{"$f":"IF(G97<>\"Scr\",1/G97,\"\")","v":1.4164305949008499E-3},{"$f":"IF(H97<>\"\",+H97/$H$153,0)","v":1.2820442240222376E-3},{"$f":"(1-I97)*I97/(1-I97/92)","v":1.2804184295978453E-3},{"$f":"IF(J97<>\"\",+J97/$J$153,0)","v":1.3365949134616683E-3},{"$f":"(1-I97-K97)*(I97+K97)/(1-(I97+K97)/92)","v":2.6118562090394837E-3},{"$f":"IF(L97<>\"\",+L97/$L$153,0)","v":1.4213806666750043E-3},{"$f":"(1-I97-K97-M97)*(I97+K97+M97)/(1-(I97+K97+M97)/92)","v":4.0238747455937579E-3},{"$f":"IF(N97<>\"\",+N97/$N$153,0)","v":1.5178220957809765E-3},{"$f":"(1-I97-K97-M97-O97)*(I97+K97+M97+O97)/(1-(I97+K97+M97+O97)/92)","v":5.5272862040383949E-3},{"$f":"IF(P97<>\"\",+P97/$P$153,0)","v":1.6203314773571341E-3},{"$f":"+I$7*I97+K$7*K97+M$7*M97+O$7*O97+Q$7*Q97","v":1.3591941564529623E-3},null,null,{"$f":"ROUND(+$R97*U$6,0)","v":38},null,null,{"$f":"ROUND(+$R92*X$6,0)","v":43},null,null,{"$f":"ROUND(+$R92*AA$6,0)","v":49},null,null,{"$f":"ROUND(+$R92*AD$6,0)","v":26}]
["4A",55,{"$f":"RANK($G93,$G$44:$G$152,1)+36","v":96},{"$f":"INDEX(BFnames,MATCH(B93,Lookups!A$2:A$145,0),2)","v":"Peter Cooke"},null,null,{"$f":"INDEX(BFnames,MATCH(B93,Lookups!A$2:A$145,0),4)","v":491},{"$f":"IF(G93<>\"Scr\",1/G93,\"\")","v":2.0366598778004071E-3},{"$f":"IF(H93<>\"\",+H93/$H$153,0)","v":1.8434281510380849E-3},{"$f":"(1-I93)*I93/(1-I93/92)","v":1.8400667935914267E-3},{"$f":"IF(J93<>\"\",+J93/$J$153,0)","v":1.9207970300118844E-3},{"$f":"(1-I93-K93)*(I93+K93)/(1-(I93+K93)/92)","v":3.7502092314887466E-3},{"$f":"IF(L93<>\"\",+L93/$L$153,0)","v":2.0408760938583695E-3},{"$f":"(1-I93-K93-M93)*(I93+K93+M93)/(1-(I93+K93+M93)/92)","v":5.7717662663541282E-3},{"$f":"IF(N93<>\"\",+N93/$N$153,0)","v":2.177133962817442E-3},{"$f":"(1-I93-K93-M93-O93)*(I93+K93+M93+O93)/(1-(I93+K93+M93+O93)/92)","v":7.9192062558052796E-3},{"$f":"IF(P93<>\"\",+P93/$P$153,0)","v":2.3215260976697004E-3},{"$f":"+I$7*I93+K$7*K93+M$7*M93+O$7*O93+Q$7*Q93","v":1.952665017310256E-3},null,null,{"$f":"ROUND(+$R93*U$6,0)","v":55},null,null,{"$f":"ROUND(+$R93*X$6,0)","v":62},null,null,{"$f":"ROUND(+$R93*AA$6,0)","v":70},null,null,{"$f":"ROUND(+$R93*AD$6,0)","v":37}]
["4A",56,{"$f":"RANK($G94,$G$44:$G$152,1)+36","v":92},{"$f":"INDEX(BFnames,MATCH(B94,Lookups!A$2:A$145,0),2)","v":"Cory Crawford"},null,null,{"$f":"INDEX(BFnames,MATCH(B94,Lookups!A$2:A$145,0),4)","v":490},{"$f":"IF(G94<>\"Scr\",1/G94,\"\")","v":2.0408163265306124E-3},{"$f":"IF(H94<>\"\",+H94/$H$153,0)","v":1.8471902493055097E-3},{"$f":"(1-I94)*I94/(1-I94/92)","v":1.8438151578946977E-3},{"$f":"IF(J94<>\"\",+J94/$J$153,0)","v":1.924709848310764E-3},{"$f":"(1-I94-K94)*(I94+K94)/(1-(I94+K94)/92)","v":3.7578269340935665E-3},{"$f":"IF(L94<>\"\",+L94/$L$153,0)","v":2.0450216724585608E-3},{"$f":"(1-I94-K94-M94)*(I94+K94+M94)/(1-(I94+K94+M94)/92)","v":5.7834508638177941E-3},{"$f":"IF(N94<>\"\",+N94/$N$153,0)","v":2.1815414410149381E-3},{"$f":"(1-I94-K94-M94-O94)*(I94+K94+M94+O94)/(1-(I94+K94+M94+O94)/92)","v":7.9351776802500627E-3},{"$f":"IF(P94<>\"\",+P94/$P$153,0)","v":2.326208142494375E-3},{"$f":"+I$7*I94+K$7*K94+M$7*M94+O$7*O94+Q$7*Q94","v":1.9566386719638619E-3},null,null,{"$f":"ROUND(+$R94*U$6,0)","v":55},null,null,{"$f":"ROUND(+$R94*X$6,0)","v":63},null,null,{"$f":"ROUND(+$R94*AA$6,0)","v":70},null,null,{"$f":"ROUND(+$R94*AD$6,0)","v":37}]
["4A",57,{"$f":"RANK($G95,$G$44:$G$152,1)+36","v":79},{"$f":"INDEX(BFnames,MATCH(B95,Lookups!A$2:A$145,0),2)","v":"Ben Campbell"},null,null,{"$f":"INDEX(BFnames,MATCH(B95,Lookups!A$2:A$145,0),4)","v":407.5},{"$f":"IF(G95<>\"Scr\",1/G95,\"\")","v":2.4539877300613498E-3},{"$f":"IF(H95<>\"\",+H95/$H$153,0)","v":2.2211612813734963E-3},{"$f":"(1-I95)*I95/(1-I95/92)","v":2.2162812317406298E-3},{"$f":"IF(J95<>\"\",+J95/$J$153,0)","v":2.313517325797535E-3},{"$f":"(1-I95-K95)*(I95+K95)/(1-(I95+K95)/92)","v":4.5143378087429444E-3},{"$f":"IF(L95<>\"\",+L95/$L$153,0)","v":2.4567173575558133E-3},{"$f":"(1-I95-K95-M95)*(I95+K95+M95)/(1-(I95+K95+M95)/92)","v":6.9430439729479343E-3},{"$f":"IF(N95<>\"\",+N95/$N$153,0)","v":2.6189447287490782E-3},{"$f":"(1-I95-K95-M95-O95)*(I95+K95+M95+O95)/(1-(I95+K95+M95+O95)/92)","v":9.5189763996470448E-3},{"$f":"IF(P95<>\"\",+P95/$P$153,0)","v":2.7905008937837606E-3},{"$f":"+I$7*I95+K$7*K95+M$7*M95+O$7*O95+Q$7*Q95","v":2.3514090300588817E-3},null,null,{"$f":"ROUND(+$R95*U$6,0)","v":66},null,null,{"$f":"ROUND(+$R95*X$6,0)","v":75},null,null,{"$f":"ROUND(+$R95*AA$6,0)","v":85},null,null,{"$f":"ROUND(+$R95*AD$6,0)","v":45}]
["4A",59,{"$f":"RANK($G96,$G$44:$G$152,1)+36","v":139},{"$f":"INDEX(BFnames,MATCH(B96,Lookups!A$2:A$145,0),2)","v":"Anthony Choat"},null,null,{"$f":"INDEX(BFnames,MATCH(B96,Lookups!A$2:A$145,0),4)","v":1110},{"$f":"IF(G96<>\"Scr\",1/G96,\"\")","v":9.0090090090090091E-4},{"$f":"IF(H96<>\"\",+H96/$H$153,0)","v":8.154263262699998E-4},{"$f":"(1-I96)*I96/(1-I96/92)","v":8.1476862773934814E-4},{"$f":"IF(J96<>\"\",+J96/$J$153,0)","v":8.5051540833147403E-4},{"$f":"(1-I96-K96)*(I96+K96)/(1-(I96+K96)/92)","v":1.6631964900040994E-3},{"$f":"IF(L96<>\"\",+L96/$L$153,0)","v":9.0511695383220709E-4},{"$f":"(1-I96-K96-M96)*(I96+K96+M96)/(1-(I96+K96+M96)/92)","v":2.5645200144745811E-3},{"$f":"IF(N96<>\"\",+N96/$N$153,0)","v":9.673474919427937E-4},{"$f":"(1-I96-K96-M96-O96)*(I96+K96+M96+O96)/(1-(I96+K96+M96+O96)/92)","v":3.5260214761680978E-3},{"$f":"IF(P96<>\"\",+P96/$P$153,0)","v":1.033657997209936E-3},{"$f":"+I$7*I96+K$7*K96+M$7*M96+O$7*O96+Q$7*Q96","v":8.6512092967149412E-4},null,null,{"$f":"ROUND(+$R96*U$6,0)","v":24},null,null,{"$f":"ROUND(+$R96*X$6,0)","v":28},null,null,{"$f":"ROUND(+$R96*AA$6,0)","v":31},null,null,{"$f":"ROUND(+$R96*AD$6,0)","v":17}]
["4A",60,{"$f":"RANK($G97,$G$44:$G$152,1)+36","v":106},{"$f":"INDEX(BFnames,MATCH(B97,Lookups!A$2:A$145,0),2)","v":"Benjamin Clementson"},null,null,{"$f":"INDEX(BFnames,MATCH(B97,Lookups!A$2:A$145,0),4)","v":706},{"$f":"IF(G97<>\"Scr\",1/G97,\"\")","v":1.4164305949008499E-3},{"$f":"IF(H97<>\"\",+H97/$H$153,0)","v":1.2820442240222376E-3},{"$f":"(1-I97)*I97/(1-I97/92)","v":1.2804184295978453E-3},{"$f":"IF(J97<>\"\",+J97/$J$153,0)","v":1.3365949134616683E-3},{"$f":"(1-I97-K97)*(I97+K97)/(1-(I97+K97)/92)","v":2.6118562090394837E-3},{"$f":"IF(L97<>\"\",+L97/$L$153,0)","v":1.4213806666750043E-3},{"$f":"(1-I97-K97-M97)*(I97+K97+M97)/(1-(I97+K97+M97)/92)","v":4.0238747455937579E-3},{"$f":"IF(N97<>\"\",+N97/$N$153,0)","v":1.5178220957809765E-3},{"$f":"(1-I97-K97-M97-O97)*(I97+K97+M97+O97)/(1-(I97+K97+M97+O97)/92)","v":5.5272862040383949E-3},{"$f":"IF(P97<>\"\",+P97/$P$153,0)","v":1.6203314773571341E-3},{"$f":"+I$7*I97+K$7*K97+M$7*M97+O$7*O97+Q$7*Q97","v":1.3591941564529623E-3},null,null,{"$f":"ROUND(+$R97*U$6,0)","v":38},null,null,{"$f":"ROUND(+$R97*X$6,0)","v":43},null,null,{"$f":"ROUND(+$R97*AA$6,0)","v":49},null,null,{"$f":"ROUND(+$R97*AD$6,0)","v":26}]
["4A",61,{"$f":"RANK($G98,$G$44:$G$152,1)+36","v":103},{"$f":"INDEX(BFnames,MATCH(B98,Lookups!A$2:A$145,0),2)","v":"Mitch Davis"},null,null,{"$f":"INDEX(BFnames,MATCH(B98,Lookups!A$2:A$145,0),4)","v":618},{"$f":"IF(G98<>\"Scr\",1/G98,\"\")","v":1.6181229773462784E-3},{"$f":"IF(H98<>\"\",+H98/$H$153,0)","v":1.4646006831063102E-3},{"$f":"(1-I98)*I98/(1-I98/92)","v":1.4624789099846002E-3},{"$f":"IF(J98<>\"\",+J98/$J$153,0)","v":1.526643030860098E-3},{"$f":"(1-I98-K98)*(I98+K98)/(1-(I98+K98)/92)","v":2.9823931431050849E-3},{"$f":"IF(L98<>\"\",+L98/$L$153,0)","v":1.6230280745786585E-3},{"$f":"(1-I98-K98-M98)*(I98+K98+M98)/(1-(I98+K98+M98)/92)","v":4.5932106574755865E-3},{"$f":"IF(N98<>\"\",+N98/$N$153,0)","v":1.7325779422252816E-3},{"$f":"(1-I98-K98-M98-O98)*(I98+K98+M98+O98)/(1-(I98+K98+M98+O98)/92)","v":6.3070023335703995E-3},{"$f":"IF(P98<>\"\",+P98/$P$153,0)","v":1.8489063224883134E-3},{"$f":"+I$7*I98+K$7*K98+M$7*M98+O$7*O98+Q$7*Q98","v":1.552298012739571E-3},null,null,{"$f":"ROUND(+$R98*U$6,0)","v":43},null,null,{"$f":"ROUND(+$R98*X$6,0)","v":50},null,null,{"$f":"ROUND(+$R98*AA$6,0)","v":56},null,null,{"$f":"ROUND(+$R98*AD$6,0)","v":30}]
["4A",62,{"$f":"RANK($G99,$G$44:$G$152,1)+36","v":139},{"$f":"INDEX(BFnames,MATCH(B99,Lookups!A$2:A$145,0),2)","v":"Martin Dive"},null,null,{"$f":"INDEX(BFnames,MATCH(B99,Lookups!A$2:A$145,0),4)","v":1110},{"$f":"IF(G99<>\"Scr\",1/G99,\"\")","v":9.0090090090090091E-4},{"$f":"IF(H99<>\"\",+H99/$H$153,0)","v":8.154263262699998E-4},{"$f":"(1-I99)*I99/(1-I99/92)","v":8.1476862773934814E-4},{"$f":"IF(J99<>\"\",+J99/$J$153,0)","v":8.5051540833147403E-4},{"$f":"(1-I99-K99)*(I99+K99)/(1-(I99+K99)/92)","v":1.6631964900040994E-3},{"$f":"IF(L99<>\"\",+L99/$L$153,0)","v":9.0511695383220709E-4},{"$f":"(1-I99-K99-M99)*(I99+K99+M99)/(1-(I99+K99+M99)/92)","v":2.5645200144745811E-3},{"$f":"IF(N99<>\"\",+N99/$N$153,0)","v":9.673474919427937E-4},{"$f":"(1-I99-K99-M99-O99)*(I99+K99+M99+O99)/(1-(I99+K99+M99+O99)/92)","v":3.5260214761680978E-3},{"$f":"IF(P99<>\"\",+P99/$P$153,0)","v":1.033657997209936E-3},{"$f":"+I$7*I99+K$7*K99+M$7*M99+O$7*O99+Q$7*Q99","v":8.6512092967149412E-4},null,null,{"$f":"ROUND(+$R99*U$6,0)","v":24},null,null,{"$f":"ROUND(+$R99*X$6,0)","v":28},null,null,{"$f":"ROUND(+$R99*AA$6,0)","v":31},null,null,{"$f":"ROUND(+$R99*AD$6,0)","v":17}]
["4B",65,{"$f":"RANK($G100,$G$44:$G$152,1)+36","v":132},{"$f":"INDEX(BFnames,MATCH(B100,Lookups!A$2:A$145,0),2)","v":"Alex Edge"},null,null,{"$f":"INDEX(BFnames,MATCH(B100,Lookups!A$2:A$145,0),4)","v":1090},{"$f":"IF(G100<>\"Scr\",1/G100,\"\")","v":9.1743119266055051E-4},{"$f":"IF(H100<>\"\",+H100/$H$153,0)","v":8.3038827721073369E-4},{"$f":"(1-I100)*I100/(1-I100/92)","v":8.2970622141458506E-4},{"$f":"IF(J100<>\"\",+J100/$J$153,0)","v":8.6610836705821594E-4},{"$f":"(1-I100-K100)*(I100+K100)/(1-(I100+K100)/92)","v":1.6936497746131859E-3},{"$f":"IF(L100<>\"\",+L100/$L$153,0)","v":9.2168973062991047E-4},{"$f":"(1-I100-K100-M100)*(I100+K100+M100)/(1-(I100+K100+M100)/92)","v":2.6114057918210612E-3},{"$f":"IF(N100<>\"\",+N100/$N$153,0)","v":9.8503299990058512E-4},{"$f":"(1-I100-K100-M100-O100)*(I100+K100+M100+O100)/(1-(I100+K100+M100+O100)/92)","v":3.5903768035806618E-3},{"$f":"IF(P100<>\"\",+P100/$P$153,0)","v":1.0525238490751811E-3},{"$f":"+I$7*I100+K$7*K100+M$7*M100+O$7*O100+Q$7*Q100","v":8.8097430263698066E-4},null,null,{"$f":"ROUND(+$R100*U$6,0)","v":25},null,null,{"$f":"ROUND(+$R100*X$6,0)","v":28},null,null,{"$f":"ROUND(+$R100*AA$6,0)","v":32},null,null,{"$f":"ROUND(+$R100*AD$6,0)","v":17}]
["4B",66,{"$f":"RANK($G101,$G$44:$G$152,1)+36","v":86},{"$f":"INDEX(BFnames,MATCH(B101,Lookups!A$2:A$145,0),2)","v":"Connor Fewkes"},null,null,{"$f":"INDEX(BFnames,MATCH(B101,Lookups!A$2:A$145,0),4)","v":429},{"$f":"IF(G101<>\"Scr\",1/G101,\"\")","v":2.331002331002331E-3},{"$f":"IF(H101<>\"\",+H101/$H$153,0)","v":2.1098443406986009E-3},{"$f":"(1-I101)*I101/(1-I101/92)","v":2.1054411818301247E-3},{"$f":"IF(J101<>\"\",+J101/$J$153,0)","v":2.1978143309845433E-3},{"$f":"(1-I101-K101)*(I101+K101)/(1-(I101+K101)/92)","v":4.2893035838403124E-3},{"$f":"IF(L101<>\"\",+L101/$L$153,0)","v":2.3342529984881964E-3},{"$f":"(1-I101-K101-M101)*(I101+K101+M101)/(1-(I101+K101+M101)/92)","v":6.5982730398272673E-3},{"$f":"IF(N101<>\"\",+N101/$N$153,0)","v":2.488895715457449E-3},{"$f":"(1-I101-K101-M101-O101)*(I101+K101+M101+O101)/(1-(I101+K101+M101+O101)/92)","v":9.0483337702981365E-3},{"$f":"IF(P101<>\"\",+P101/$P$153,0)","v":2.6525313661043383E-3},{"$f":"+I$7*I101+K$7*K101+M$7*M101+O$7*O101+Q$7*Q101","v":2.2339485923722887E-3},null,null,{"$f":"ROUND(+$R101*U$6,0)","v":63},null,null,{"$f":"ROUND(+$R101*X$6,0)","v":71},null,null,{"$f":"ROUND(+$R101*AA$6,0)","v":80},null,null,{"$f":"ROUND(+$R101*AD$6,0)","v":43}]
["4B",67,{"$f":"RANK($G102,$G$44:$G$152,1)+36","v":81},{"$f":"INDEX(BFnames,MATCH(B102,Lookups!A$2:A$145,0),2)","v":"Nick Flanagan"},null,null,{"$f":"INDEX(BFnames,MATCH(B102,Lookups!A$2:A$145,0),4)","v":414},{"$f":"IF(G102<>\"Scr\",1/G102,\"\")","v":2.4154589371980675E-3},{"$f":"IF(H102<>\"\",+H102/$H$153,0)","v":2.1862879762311587E-3},{"$f":"(1-I102)*I102/(1-I102/92)","v":2.1815599637065599E-3},{"$f":"IF(J102<>\"\",+J102/$J$153,0)","v":2.2772727129658898E-3},{"$f":"(1-I102-K102)*(I102+K102)/(1-(I102+K102)/92)","v":4.4438529174229769E-3},{"$f":"IF(L102<>\"\",+L102/$L$153,0)","v":2.4183592498360417E-3},{"$f":"(1-I102-K102-M102)*(I102+K102+M102)/(1-(I102+K102+M102)/92)","v":6.8350704040216785E-3},{"$f":"IF(N102<>\"\",+N102/$N$153,0)","v":2.5782166546816491E-3},{"$f":"(1-I102-K102-M102-O102)*(I102+K102+M102+O102)/(1-(I102+K102+M102+O102)/92)","v":9.3716060688377144E-3},{"$f":"IF(P102<>\"\",+P102/$P$153,0)","v":2.7472990806291556E-3},{"$f":"+I$7*I102+K$7*K102+M$7*M102+O$7*O102+Q$7*Q102","v":2.3146154379422765E-3},null,null,{"$f":"ROUND(+$R102*U$6,0)","v":65},null,null,{"$f":"ROUND(+$R102*X$6,0)","v":74},null,null,{"$f":"ROUND(+$R102*AA$6,0)","v":83},null,null,{"$f":"ROUND(+$R102*AD$6,0)","v":44}]
["4B",68,{"$f":"RANK($G103,$G$44:$G$152,1)+36","v":123},{"$f":"INDEX(BFnames,MATCH(B103,Lookups!A$2:A$145,0),2)","v":"Daniel Fox"},null,null,{"$f":"INDEX(BFnames,MATCH(B103,Lookups!A$2:A$145,0),4)","v":852.17391304347825},{"$f":"IF(G103<>\"Scr\",1/G103,\"\")","v":1.173469387755102E-3},{"$f":"IF(H103<>\"\",+H103/$H$153,0)","v":1.062134393350668E-3},{"$f":"(1-I103)*I103/(1-I103/92)","v":1.0610185132752051E-3},{"$f":"IF(J103<>\"\",+J103/$J$153,0)","v":1.1075691470464968E-3},{"$f":"(1-I103-K103)*(I103+K103)/(1-(I103+K103)/92)","v":2.1650469868364796E-3},{"$f":"IF(L103<>\"\",+L103/$L$153,0)","v":1.1782256308298265E-3},{"$f":"(1-I103-K103-M103)*(I103+K103+M103)/(1-(I103+K103+M103)/92)","v":3.3368419709542034E-3},{"$f":"IF(N103<>\"\",+N103/$N$153,0)","v":1.2586705088645318E-3},{"$f":"(1-I103-K103-M103-O103)*(I103+K103+M103+O103)/(1-(I103+K103+M103+O103)/92)","v":4.5856085288569701E-3},{"$f":"IF(P103<>\"\",+P103/$P$153,0)","v":1.3442773845717571E-3},{"$f":"+I$7*I103+K$7*K103+M$7*M103+O$7*O103+Q$7*Q103","v":1.1264339406035228E-3},null,null,{"$f":"ROUND(+$R103*U$6,0)","v":32},null,null,{"$f":"ROUND(+$R103*X$6,0)","v":36},null,null,{"$f":"ROUND(+$R103*AA$6,0)","v":41},null,null,{"$f":"ROUND(+$R103*AD$6,0)","v":21}]
["4B",70,{"$f":"RANK($G104,$G$44:$G$152,1)+36","v":131},{"$f":"INDEX(BFnames,MATCH(B104,Lookups!A$2:A$145,0),2)","v":"Gavin Fairfax"},null,null,{"$f":"INDEX(BFnames,MATCH(B104,Lookups!A$2:A$145,0),4)","v":955},{"$f":"IF(G104<>\"Scr\",1/G104,\"\")","v":1.0471204188481676E-3},{"$f":"IF(H104<>\"\",+H104/$H$153,0)","v":9.4777300749706781E-4},{"$f":"(1-I104)*I104/(1-I104/92)","v":9.4688448851419128E-4},{"$f":"IF(J104<>\"\",+J104/$J$153,0)","v":9.8842765905932974E-4},{"$f":"(1-I104-K104)*(I104+K104)/(1-(I104+K104)/92)","v":1.9324924641134539E-3},{"$f":"IF(L104<>\"\",+L104/$L$153,0)","v":1.0516687011633569E-3},{"$f":"(1-I104-K104-M104)*(I104+K104+M104)/(1-(I104+K104+M104)/92)","v":2.9790387541290082E-3},{"$f":"IF(N104<>\"\",+N104/$N$153,0)","v":1.1237056645851513E-3},{"$f":"(1-I104-K104-M104-O104)*(I104+K104+M104+O104)/(1-(I104+K104+M104+O104)/92)","v":4.0948529862684076E-3},{"$f":"IF(P104<>\"\",+P104/$P$153,0)","v":1.2004117289878757E-3},{"$f":"+I$7*I104+K$7*K104+M$7*M104+O$7*O104+Q$7*Q104","v":1.0053272522735262E-3},null,null,{"$f":"ROUND(+$R104*U$6,0)","v":28},null,null,{"$f":"ROUND(+$R104*X$6,0)","v":32},null,null,{"$f":"ROUND(+$R104*AA$6,0)","v":36},null,null,{"$f":"ROUND(+$R104*AD$6,0)","v":19}]
["4B",71,{"$f":"RANK($G105,$G$44:$G$152,1)+36","v":112},{"$f":"INDEX(BFnames,MATCH(B105,Lookups!A$2:A$145,0),2)","v":"Matthew Guyatt"},null,null,{"$f":"INDEX(BFnames,MATCH(B105,Lookups!A$2:A$145,0),4)","v":721.42857142857144},{"$f":"IF(G105<>\"Scr\",1/G105,\"\")","v":1.3861386138613861E-3},{"$f":"IF(H105<>\"\",+H105/$H$153,0)","v":1.2546262485381976E-3},{"$f":"(1-I105)*I105/(1-I105/92)","v":1.25306924992307E-3},{"$f":"IF(J105<>\"\",+J105/$J$153,0)","v":1.3080458285721801E-3},{"$f":"(1-I105-K105)*(I105+K105)/(1-(I105+K105)/92)","v":2.556175991553378E-3},{"$f":"IF(L105<>\"\",+L105/$L$153,0)","v":1.3910793107362273E-3},{"$f":"(1-I105-K105-M105)*(I105+K105+M105)/(1-(I105+K105+M105)/92)","v":3.9382884879572604E-3},{"$f":"IF(N105<>\"\",+N105/$N$153,0)","v":1.4855386075640215E-3},{"$f":"(1-I105-K105-M105-O105)*(I105+K105+M105+O105)/(1-(I105+K105+M105+O105)/92)","v":5.4100239750747405E-3},{"$f":"IF(P105<>\"\",+P105/$P$153,0)","v":1.5859558952575413E-3},{"$f":"+I$7*I105+K$7*K105+M$7*M105+O$7*O105+Q$7*Q105","v":1.3301826581690486E-3},null,null,{"$f":"ROUND(+$R105*U$6,0)","v":37},null,null,{"$f":"ROUND(+$R105*X$6,0)","v":43},null,null,{"$f":"ROUND(+$R105*AA$6,0)","v":48},null,null,{"$f":"ROUND(+$R105*AD$6,0)","v":25}]
["4B",72,{"$f":"RANK($G106,$G$44:$G$152,1)+36","v":88},{"$f":"INDEX(BFnames,MATCH(B106,Lookups!A$2:A$145,0),2)","v":"David Gleeson"},null,null,{"$f":"INDEX(BFnames,MATCH(B106,Lookups!A$2:A$145,0),4)","v":485},{"$f":"IF(G106<>\"Scr\",1/G106,\"\")","v":2.0618556701030928E-3},{"$f":"IF(H106<>\"\",+H106/$H$153,0)","v":1.8662334477519583E-3},{"$f":"(1-I106)*I106/(1-I106/92)","v":1.8627884074055804E-3},{"$f":"IF(J106<>\"\",+J106/$J$153,0)","v":1.9445155213641031E-3},{"$f":"(1-I106-K106)*(I106+K106)/(1-(I106+K106)/92)","v":3.7963844121494095E-3},{"$f":"IF(L106<>\"\",+L106/$L$153,0)","v":2.066004777759168E-3},{"$f":"(1-I106-K106-M106)*(I106+K106+M106)/(1-(I106+K106+M106)/92)","v":5.8425907238708608E-3},{"$f":"IF(N106<>\"\",+N106/$N$153,0)","v":2.2038492393449513E-3},{"$f":"(1-I106-K106-M106-O106)*(I106+K106+M106+O106)/(1-(I106+K106+M106+O106)/92)","v":8.0160109090089329E-3},{"$f":"IF(P106<>\"\",+P106/$P$153,0)","v":2.3499045135776586E-3},{"$f":"+I$7*I106+K$7*K106+M$7*M106+O$7*O106+Q$7*Q106","v":1.9767520295165368E-3},null,null,{"$f":"ROUND(+$R106*U$6,0)","v":55},null,null,{"$f":"ROUND(+$R106*X$6,0)","v":63},null,null,{"$f":"ROUND(+$R106*AA$6,0)","v":71},null,null,{"$f":"ROUND(+$R106*AD$6,0)","v":38}]
["4B",73,{"$f":"RANK($G107,$G$44:$G$152,1)+36","v":92},{"$f":"INDEX(BFnames,MATCH(B107,Lookups!A$2:A$145,0),2)","v":"Matthew Giles"},null,null,{"$f":"INDEX(BFnames,MATCH(B107,Lookups!A$2:A$145,0),4)","v":490},{"$f":"IF(G107<>\"Scr\",1/G107,\"\")","v":2.0408163265306124E-3},{"$f":"IF(H107<>\"\",+H107/$H$153,0)","v":1.8471902493055097E-3},{"$f":"(1-I107)*I107/(1-I107/92)","v":1.8438151578946977E-3},{"$f":"IF(J107<>\"\",+J107/$J$153,0)","v":1.924709848310764E-3},{"$f":"(1-I107-K107)*(I107+K107)/(1-(I107+K107)/92)","v":3.7578269340935665E-3},{"$f":"IF(L107<>\"\",+L107/$L$153,0)","v":2.0450216724585608E-3},{"$f":"(1-I107-K107-M107)*(I107+K107+M107)/(1-(I107+K107+M107)/92)","v":5.7834508638177941E-3},{"$f":"IF(N107<>\"\",+N107/$N$153,0)","v":2.1815414410149381E-3},{"$f":"(1-I107-K107-M107-O107)*(I107+K107+M107+O107)/(1-(I107+K107+M107+O107)/92)","v":7.9351776802500627E-3},{"$f":"IF(P107<>\"\",+P107/$P$153,0)","v":2.326208142494375E-3},{"$f":"+I$7*I107+K$7*K107+M$7*M107+O$7*O107+Q$7*Q107","v":1.9566386719638619E-3},null,null,{"$f":"ROUND(+$R107*U$6,0)","v":55},null,null,{"$f":"ROUND(+$R107*X$6,0)","v":63},null,null,{"$f":"ROUND(+$R107*AA$6,0)","v":70},null,null,{"$f":"ROUND(+$R107*AD$6,0)","v":37}]
["4B",75,{"$f":"RANK($G108,$G$44:$G$152,1)+36","v":88},{"$f":"INDEX(BFnames,MATCH(B108,Lookups!A$2:A$145,0),2)","v":"Mathew Goggin"},null,null,{"$f":"INDEX(BFnames,MATCH(B108,Lookups!A$2:A$145,0),4)","v":485},{"$f":"IF(G108<>\"Scr\",1/G108,\"\")","v":2.0618556701030928E-3},{"$f":"IF(H108<>\"\",+H108/$H$153,0)","v":1.8662334477519583E-3},{"$f":"(1-I108)*I108/(1-I108/92)","v":1.8627884074055804E-3},{"$f":"IF(J108<>\"\",+J108/$J$153,0)","v":1.9445155213641031E-3},{"$f":"(1-I108-K108)*(I108+K108)/(1-(I108+K108)/92)","v":3.7963844121494095E-3},{"$f":"IF(L108<>\"\",+L108/$L$153,0)","v":2.066004777759168E-3},{"$f":"(1-I108-K108-M108)*(I108+K108+M108)/(1-(I108+K108+M108)/92)","v":5.8425907238708608E-3},{"$f":"IF(N108<>\"\",+N108/$N$153,0)","v":2.2038492393449513E-3},{"$f":"(1-I108-K108-M108-O108)*(I108+K108+M108+O108)/(1-(I108+K108+M108+O108)/92)","v":8.0160109090089329E-3},{"$f":"IF(P108<>\"\",+P108/$P$153,0)","v":2.3499045135776586E-3},{"$f":"+I$7*I108+K$7*K108+M$7*M108+O$7*O108+Q$7*Q108","v":1.9767520295165368E-3},null,null,{"$f":"ROUND(+$R108*U$6,0)","v":55},null,null,{"$f":"ROUND(+$R108*X$6,0)","v":63},null,null,{"$f":"ROUND(+$R108*AA$6,0)","v":71},null,null,{"$f":"ROUND(+$R108*AD$6,0)","v":38}]
["4B",77,{"$f":"RANK($G109,$G$44:$G$152,1)+36","v":99},{"$f":"INDEX(BFnames,MATCH(B109,Lookups!A$2:A$145,0),2)","v":"Viktor Hovland"},null,null,{"$f":"INDEX(BFnames,MATCH(B109,Lookups!A$2:A$145,0),4)","v":514.40476190476193},{"$f":"IF(G109<>\"Scr\",1/G109,\"\")","v":1.9439944457301549E-3},{"$f":"IF(H109<>\"\",+H109/$H$153,0)","v":1.7595545165798373E-3},{"$f":"(1-I109)*I109/(1-I109/92)","v":1.7564920784348681E-3},{"$f":"IF(J109<>\"\",+J109/$J$153,0)","v":1.8335555965944127E-3},{"$f":"(1-I109-K109)*(I109+K109)/(1-(I109+K109)/92)","v":3.5803395049984637E-3},{"$f":"IF(L109<>\"\",+L109/$L$153,0)","v":1.9484324347277418E-3},{"$f":"(1-I109-K109-M109)*(I109+K109+M109)/(1-(I109+K109+M109)/92)","v":5.5111658145249338E-3},{"$f":"IF(N109<>\"\",+N109/$N$153,0)","v":2.0788344010853107E-3},{"$f":"(1-I109-K109-M109-O109)*(I109+K109+M109+O109)/(1-(I109+K109+M109+O109)/92)","v":7.5629332432964932E-3},{"$f":"IF(P109<>\"\",+P109/$P$153,0)","v":2.217084178906916E-3},{"$f":"+I$7*I109+K$7*K109+M$7*M109+O$7*O109+Q$7*Q109","v":1.8640628668259011E-3},null,null,{"$f":"ROUND(+$R109*U$6,0)","v":52},null,null,{"$f":"ROUND(+$R109*X$6,0)","v":60},null,null,{"$f":"ROUND(+$R109*AA$6,0)","v":67},null,null,{"$f":"ROUND(+$R109*AD$6,0)","v":36}]
["4B",78,{"$f":"RANK($G110,$G$44:$G$152,1)+36","v":121},{"$f":"INDEX(BFnames,MATCH(B110,Lookups!A$2:A$145,0),2)","v":"Ashley Hall"},null,null,{"$f":"INDEX(BFnames,MATCH(B110,Lookups!A$2:A$145,0),4)","v":849.61538461538464},{"$f":"IF(G110<>\"Scr\",1/G110,\"\")","v":1.1770031688546853E-3},{"$f":"IF(H110<>\"\",+H110/$H$153,0)","v":1.0653329006859299E-3},{"$f":"(1-I110)*I110/(1-I110/92)","v":1.0642102897383296E-3},{"$f":"IF(J110<>\"\",+J110/$J$153,0)","v":1.1109009580286763E-3},{"$f":"(1-I110-K110)*(I110+K110)/(1-(I110+K110)/92)","v":2.1715492322868465E-3},{"$f":"IF(L110<>\"\",+L110/$L$153,0)","v":1.1817641740088653E-3},{"$f":"(1-I110-K110-M110)*(I110+K110+M110)/(1-(I110+K110+M110)/92)","v":3.3468440416716512E-3},{"$f":"IF(N110<>\"\",+N110/$N$153,0)","v":1.2624433310566563E-3},{"$f":"(1-I110-K110-M110-O110)*(I110+K110+M110+O110)/(1-(I110+K110+M110+O110)/92)","v":4.5993238734956341E-3},{"$f":"IF(P110<>\"\",+P110/$P$153,0)","v":1.3482980565291077E-3},{"$f":"+I$7*I110+K$7*K110+M$7*M110+O$7*O110+Q$7*Q110","v":1.1298204872487929E-3},null,null,{"$f":"ROUND(+$R110*U$6,0)","v":32},null,null,{"$f":"ROUND(+$R110*X$6,0)","v":36},null,null,{"$f":"ROUND(+$R110*AA$6,0)","v":41},null,null,{"$f":"ROUND(+$R110*AD$6,0)","v":22}]
["4B",79,{"$f":"RANK($G111,$G$44:$G$152,1)+36","v":100},{"$f":"INDEX(BFnames,MATCH(B111,Lookups!A$2:A$145,0),2)","v":"Simon Hawkes"},null,null,{"$f":"INDEX(BFnames,MATCH(B111,Lookups!A$2:A$145,0),4)","v":531.25},{"$f":"IF(G111<>\"Scr\",1/G111,\"\")","v":1.8823529411764706E-3},{"$f":"IF(H111<>\"\",+H111/$H$153,0)","v":1.7037613593594348E-3},{"$f":"(1-I111)*I111/(1-I111/92)","v":1.7008900556197157E-3},{"$f":"IF(J111<>\"\",+J111/$J$153,0)","v":1.7755141164383875E-3},{"$f":"(1-I111-K111)*(I111+K111)/(1-(I111+K111)/92)","v":3.4673012450938262E-3},{"$f":"IF(L111<>\"\",+L111/$L$153,0)","v":1.8869166450502838E-3},{"$f":"(1-I111-K111-M111)*(I111+K111+M111)/(1-(I111+K111+M111)/92)","v":5.3377074417052224E-3},{"$f":"IF(N111<>\"\",+N111/$N$153,0)","v":2.0134051897878497E-3},{"$f":"(1-I111-K111-M111-O111)*(I111+K111+M111+O111)/(1-(I111+K111+M111+O111)/92)","v":7.3257264727707334E-3},{"$f":"IF(P111<>\"\",+P111/$P$153,0)","v":2.1475466911169225E-3},{"$f":"+I$7*I111+K$7*K111+M$7*M111+O$7*O111+Q$7*Q111","v":1.8051115543288138E-3},null,null,{"$f":"ROUND(+$R111*U$6,0)","v":51},null,null,{"$f":"ROUND(+$R111*X$6,0)","v":58},null,null,{"$f":"ROUND(+$R111*AA$6,0)","v":65},null,null,{"$f":"ROUND(+$R111*AD$6,0)","v":34}]
["4B",83,{"$f":"RANK($G112,$G$44:$G$152,1)+36","v":119},{"$f":"INDEX(BFnames,MATCH(B112,Lookups!A$2:A$145,0),2)","v":"Damien Jordan"},null,null,{"$f":"INDEX(BFnames,MATCH(B112,Lookups!A$2:A$145,0),4)","v":819.39393939393938},{"$f":"IF(G112<>\"Scr\",1/G112,\"\")","v":1.2204142011834321E-3},{"$f":"IF(H112<>\"\",+H112/$H$153,0)","v":1.104625234144604E-3},{"$f":"(1-I112)*I112/(1-I112/92)","v":1.1034182857549805E-3},{"$f":"IF(J112<>\"\",+J112/$J$153,0)","v":1.15182914746386E-3},{"$f":"(1-I112-K112)*(I112+K112)/(1-(I112+K112)/92)","v":2.2514180150370196E-3},{"$f":"IF(L112<>\"\",+L112/$L$153,0)","v":1.2252290260474509E-3},{"$f":"(1-I112-K112-M112)*(I112+K112+M112)/(1-(I112+K112+M112)/92)","v":3.4696925966867641E-3},{"$f":"IF(N112<>\"\",+N112/$N$153,0)","v":1.3087823110263695E-3},{"$f":"(1-I112-K112-M112-O112)*(I112+K112+M112+O112)/(1-(I112+K112+M112+O112)/92)","v":4.7677654157584461E-3},{"$f":"IF(P112<>\"\",+P112/$P$153,0)","v":1.3976769240144943E-3},{"$f":"+I$7*I112+K$7*K112+M$7*M112+O$7*O112+Q$7*Q112","v":1.1714200704061057E-3},null,null,{"$f":"ROUND(+$R112*U$6,0)","v":33},null,null,{"$f":"ROUND(+$R112*X$6,0)","v":37},null,null,{"$f":"ROUND(+$R112*AA$6,0)","v":42},null,null,{"$f":"ROUND(+$R112*AD$6,0)","v":22}]
["4B",84,{"$f":"RANK($G113,$G$44:$G$152,1)+36","v":111},{"$f":"INDEX(BFnames,MATCH(B113,Lookups!A$2:A$145,0),2)","v":"Steven Jeffress"},null,null,{"$f":"INDEX(BFnames,MATCH(B113,Lookups!A$2:A$145,0),4)","v":716.21621621621625},{"$f":"IF(G113<>\"Scr\",1/G113,\"\")","v":1.3962264150943395E-3},{"$f":"IF(H113<>\"\",+H113/$H$153,0)","v":1.2637569516946749E-3},{"$f":"(1-I113)*I113/(1-I113/92)","v":1.2621772079445532E-3},{"$f":"IF(J113<>\"\",+J113/$J$153,0)","v":1.317553384916367E-3},{"$f":"(1-I113-K113)*(I113+K113)/(1-(I113+K113)/92)","v":2.5747194143162558E-3},{"$f":"IF(L113<>\"\",+L113/$L$153,0)","v":1.4011707018771005E-3},{"$f":"(1-I113-K113-M113)*(I113+K113+M113)/(1-(I113+K113+M113)/92)","v":3.9667925971390702E-3},{"$f":"IF(N113<>\"\",+N113/$N$153,0)","v":1.4962904747249164E-3},{"$f":"(1-I113-K113-M113-O113)*(I113+K113+M113+O113)/(1-(I113+K113+M113+O113)/92)","v":5.4490790787367809E-3},{"$f":"IF(P113<>\"\",+P113/$P$153,0)","v":1.5974049520783757E-3},{"$f":"+I$7*I113+K$7*K113+M$7*M113+O$7*O113+Q$7*Q113","v":1.3398443077736893E-3},null,null,{"$f":"ROUND(+$R113*U$6,0)","v":38},null,null,{"$f":"ROUND(+$R113*X$6,0)","v":43},null,null,{"$f":"ROUND(+$R113*AA$6,0)","v":48},null,null,{"$f":"ROUND(+$R113*AD$6,0)","v":26}]
["4B",85,{"$f":"RANK($G114,$G$44:$G$152,1)+36","v":90},{"$f":"INDEX(BFnames,MATCH(B114,Lookups!A$2:A$145,0),2)","v":"Matt Jager"},null,null,{"$f":"INDEX(BFnames,MATCH(B114,Lookups!A$2:A$145,0),4)","v":489},{"$f":"IF(G114<>\"Scr\",1/G114,\"\")","v":2.0449897750511249E-3},{"$f":"IF(H114<>\"\",+H114/$H$153,0)","v":1.8509677344779136E-3},{"$f":"(1-I114)*I114/(1-I114/92)","v":1.8475788247585259E-3},{"$f":"IF(J114<>\"\",+J114/$J$153,0)","v":1.92863864054764E-3},{"$f":"(1-I114-K114)*(I114+K114)/(1-(I114+K114)/92)","v":3.7654756464988821E-3},{"$f":"IF(L114<>\"\",+L114/$L$153,0)","v":2.0491841266933098E-3},{"$f":"(1-I114-K114-M114)*(I114+K114+M114)/(1-(I114+K114+M114)/92)","v":5.7951828650367994E-3},{"$f":"IF(N114<>\"\",+N114/$N$153,0)","v":2.1859668001038197E-3},{"$f":"(1-I114-K114-M114-O114)*(I114+K114+M114+O114)/(1-(I114+K114+M114+O114)/92)","v":7.9512136525164302E-3},{"$f":"IF(P114<>\"\",+P114/$P$153,0)","v":2.3309091096008435E-3},{"$f":"+I$7*I114+K$7*K114+M$7*M114+O$7*O114+Q$7*Q114","v":1.9606285323000338E-3},null,null,{"$f":"ROUND(+$R114*U$6,0)","v":55},null,null,{"$f":"ROUND(+$R114*X$6,0)","v":63},null,null,{"$f":"ROUND(+$R114*AA$6,0)","v":71},null,null,{"$f":"ROUND(+$R114*AD$6,0)","v":37}]
["4C",88,{"$f":"RANK($G115,$G$44:$G$152,1)+36","v":74},{"$f":"INDEX(BFnames,MATCH(B115,Lookups!A$2:A$145,0),2)","v":"Peter Lonard"},null,null,{"$f":"INDEX(BFnames,MATCH(B115,Lookups!A$2:A$145,0),4)","v":400},{"$f":"IF(G115<>\"Scr\",1/G115,\"\")","v":2.5000000000000001E-3},{"$f":"IF(H115<>\"\",+H115/$H$153,0)","v":2.2628080553992493E-3},{"$f":"(1-I115)*I115/(1-I115/92)","v":2.2577432859699144E-3},{"$f":"IF(J115<>\"\",+J115/$J$153,0)","v":2.3567984669491345E-3},{"$f":"(1-I115-K115)*(I115+K115)/(1-(I115+K115)/92)","v":4.5984966627659321E-3},{"$f":"IF(L115<>\"\",+L115/$L$153,0)","v":2.5025168803717306E-3},{"$f":"(1-I115-K115-M115)*(I115+K115+M115)/(1-(I115+K115+M115)/92)","v":7.0719462313234621E-3},{"$f":"IF(N115<>\"\",+N115/$N$153,0)","v":2.6675671905125034E-3},{"$f":"(1-I115-K115-M115-O115)*(I115+K115+M115+O115)/(1-(I115+K115+M115+O115)/92)","v":9.6948841808482122E-3},{"$f":"IF(P115<>\"\",+P115/$P$153,0)","v":2.8420684993808892E-3},{"$f":"+I$7*I115+K$7*K115+M$7*M115+O$7*O115+Q$7*Q115","v":2.395343878078565E-3},null,null,{"$f":"ROUND(+$R115*U$6,0)","v":67},null,null,{"$f":"ROUND(+$R115*X$6,0)","v":77},null,null,{"$f":"ROUND(+$R115*AA$6,0)","v":86},null,null,{"$f":"ROUND(+$R115*AD$6,0)","v":46}]
["4C",89,{"$f":"RANK($G116,$G$44:$G$152,1)+36","v":110},{"$f":"INDEX(BFnames,MATCH(B116,Lookups!A$2:A$145,0),2)","v":"Ryan Lynch"},null,null,{"$f":"INDEX(BFnames,MATCH(B116,Lookups!A$2:A$145,0),4)","v":708},{"$f":"IF(G116<>\"Scr\",1/G116,\"\")","v":1.4124293785310734E-3},{"$f":"IF(H116<>\"\",+H116/$H$153,0)","v":1.2784226301690673E-3},{"$f":"(1-I116)*I116/(1-I116/92)","v":1.2768060081139903E-3},{"$f":"IF(J116<>\"\",+J116/$J$153,0)","v":1.3328240022743645E-3},{"$f":"(1-I116-K116)*(I116+K116)/(1-(I116+K116)/92)","v":2.6045019473477588E-3},{"$f":"IF(L116<>\"\",+L116/$L$153,0)","v":1.4173784534788458E-3},{"$f":"(1-I116-K116-M116)*(I116+K116+M116)/(1-(I116+K116+M116)/92)","v":4.0125709739272314E-3},{"$f":"IF(N116<>\"\",+N116/$N$153,0)","v":1.5135582666396981E-3},{"$f":"(1-I116-K116-M116-O116)*(I116+K116+M116+O116)/(1-(I116+K116+M116+O116)/92)","v":5.5117995932479989E-3},{"$f":"IF(P116<>\"\",+P116/$P$153,0)","v":1.6157915563154259E-3},{"$f":"+I$7*I116+K$7*K116+M$7*M116+O$7*O116+Q$7*Q116","v":1.3553622179263516E-3},null,null,{"$f":"ROUND(+$R116*U$6,0)","v":38},null,null,{"$f":"ROUND(+$R116*X$6,0)","v":43},null,null,{"$f":"ROUND(+$R116*AA$6,0)","v":49},null,null,{"$f":"ROUND(+$R116*AD$6,0)","v":26}]
["4C",90,{"$f":"RANK($G117,$G$44:$G$152,1)+36","v":139},{"$f":"INDEX(BFnames,MATCH(B117,Lookups!A$2:A$145,0),2)","v":"Matthew Lisk"},null,null,{"$f":"INDEX(BFnames,MATCH(B117,Lookups!A$2:A$145,0),4)","v":1110},{"$f":"IF(G117<>\"Scr\",1/G117,\"\")","v":9.0090090090090091E-4},{"$f":"IF(H117<>\"\",+H117/$H$153,0)","v":8.154263262699998E-4},{"$f":"(1-I117)*I117/(1-I117/92)","v":8.1476862773934814E-4},{"$f":"IF(J117<>\"\",+J117/$J$153,0)","v":8.5051540833147403E-4},{"$f":"(1-I117-K117)*(I117+K117)/(1-(I117+K117)/92)","v":1.6631964900040994E-3},{"$f":"IF(L117<>\"\",+L117/$L$153,0)","v":9.0511695383220709E-4},{"$f":"(1-I117-K117-M117)*(I117+K117+M117)/(1-(I117+K117+M117)/92)","v":2.5645200144745811E-3},{"$f":"IF(N117<>\"\",+N117/$N$153,0)","v":9.673474919427937E-4},{"$f":"(1-I117-K117-M117-O117)*(I117+K117+M117+O117)/(1-(I117+K117+M117+O117)/92)","v":3.5260214761680978E-3},{"$f":"IF(P117<>\"\",+P117/$P$153,0)","v":1.033657997209936E-3},{"$f":"+I$7*I117+K$7*K117+M$7*M117+O$7*O117+Q$7*Q117","v":8.6512092967149412E-4},null,null,{"$f":"ROUND(+$R117*U$6,0)","v":24},null,null,{"$f":"ROUND(+$R117*X$6,0)","v":28},null,null,{"$f":"ROUND(+$R117*AA$6,0)","v":31},null,null,{"$f":"ROUND(+$R117*AD$6,0)","v":17}]
["4C",91,{"$f":"RANK($G118,$G$44:$G$152,1)+36","v":135},{"$f":"INDEX(BFnames,MATCH(B118,Lookups!A$2:A$145,0),2)","v":"Sam Lee"},null,null,{"$f":"INDEX(BFnames,MATCH(B118,Lookups!A$2:A$145,0),4)","v":1100},{"$f":"IF(G118<>\"Scr\",1/G118,\"\")","v":9.0909090909090909E-4},{"$f":"IF(H118<>\"\",+H118/$H$153,0)","v":8.2283929287245428E-4},{"$f":"(1-I118)*I118/(1-I118/92)","v":8.2216958177748652E-4},{"$f":"IF(J118<>\"\",+J118/$J$153,0)","v":8.5824106839187033E-4},{"$f":"(1-I118-K118)*(I118+K118)/(1-(I118+K118)/92)","v":1.6782849967349116E-3},{"$f":"IF(L118<>\"\",+L118/$L$153,0)","v":9.133281684013503E-4},{"$f":"(1-I118-K118-M118)*(I118+K118+M118)/(1-(I118+K118+M118)/92)","v":2.5877505488522707E-3},{"$f":"IF(N118<>\"\",+N118/$N$153,0)","v":9.7611014500844078E-4},{"$f":"(1-I118-K118-M118-O118)*(I118+K118+M118+O118)/(1-(I118+K118+M118+O118)/92)","v":3.5579081534320997E-3},{"$f":"IF(P118<>\"\",+P118/$P$153,0)","v":1.0430056200707606E-3},{"$f":"+I$7*I118+K$7*K118+M$7*M118+O$7*O118+Q$7*Q118","v":8.7297564715539352E-4},null,null,{"$f":"ROUND(+$R118*U$6,0)","v":24},null,null,{"$f":"ROUND(+$R118*X$6,0)","v":28},null,null,{"$f":"ROUND(+$R118*AA$6,0)","v":31},null,null,{"$f":"ROUND(+$R118*AD$6,0)","v":17}]
["4C",92,{"$f":"RANK($G119,$G$44:$G$152,1)+36","v":139},{"$f":"INDEX(BFnames,MATCH(B119,Lookups!A$2:A$145,0),2)","v":"Jediah Morgan"},null,null,{"$f":"INDEX(BFnames,MATCH(B119,Lookups!A$2:A$145,0),4)","v":1110},{"$f":"IF(G119<>\"Scr\",1/G119,\"\")","v":9.0090090090090091E-4},{"$f":"IF(H119<>\"\",+H119/$H$153,0)","v":8.154263262699998E-4},{"$f":"(1-I119)*I119/(1-I119/92)","v":8.1476862773934814E-4},{"$f":"IF(J119<>\"\",+J119/$J$153,0)","v":8.5051540833147403E-4},{"$f":"(1-I119-K119)*(I119+K119)/(1-(I119+K119)/92)","v":1.6631964900040994E-3},{"$f":"IF(L119<>\"\",+L119/$L$153,0)","v":9.0511695383220709E-4},{"$f":"(1-I119-K119-M119)*(I119+K119+M119)/(1-(I119+K119+M119)/92)","v":2.5645200144745811E-3},{"$f":"IF(N119<>\"\",+N119/$N$153,0)","v":9.673474919427937E-4},{"$f":"(1-I119-K119-M119-O119)*(I119+K119+M119+O119)/(1-(I119+K119+M119+O119)/92)","v":3.5260214761680978E-3},{"$f":"IF(P119<>\"\",+P119/$P$153,0)","v":1.033657997209936E-3},{"$f":"+I$7*I119+K$7*K119+M$7*M119+O$7*O119+Q$7*Q119","v":8.6512092967149412E-4},null,null,{"$f":"ROUND(+$R119*U$6,0)","v":24},null,null,{"$f":"ROUND(+$R119*X$6,0)","v":28},null,null,{"$f":"ROUND(+$R119*AA$6,0)","v":31},null,null,{"$f":"ROUND(+$R119*AD$6,0)","v":17}]
["4C",93,{"$f":"RANK($G120,$G$44:$G$152,1)+36","v":106},{"$f":"INDEX(BFnames,MATCH(B120,Lookups!A$2:A$145,0),2)","v":"Brad Moules"},null,null,{"$f":"INDEX(BFnames,MATCH(B120,Lookups!A$2:A$145,0),4)","v":706},{"$f":"IF(G120<>\"Scr\",1/G120,\"\")","v":1.4164305949008499E-3},{"$f":"IF(H120<>\"\",+H120/$H$153,0)","v":1.2820442240222376E-3},{"$f":"(1-I120)*I120/(1-I120/92)","v":1.2804184295978453E-3},{"$f":"IF(J120<>\"\",+J120/$J$153,0)","v":1.3365949134616683E-3},{"$f":"(1-I120-K120)*(I120+K120)/(1-(I120+K120)/92)","v":2.6118562090394837E-3},{"$f":"IF(L120<>\"\",+L120/$L$153,0)","v":1.4213806666750043E-3},{"$f":"(1-I120-K120-M120)*(I120+K120+M120)/(1-(I120+K120+M120)/92)","v":4.0238747455937579E-3},{"$f":"IF(N120<>\"\",+N120/$N$153,0)","v":1.5178220957809765E-3},{"$f":"(1-I120-K120-M120-O120)*(I120+K120+M120+O120)/(1-(I120+K120+M120+O120)/92)","v":5.5272862040383949E-3},{"$f":"IF(P120<>\"\",+P120/$P$153,0)","v":1.6203314773571341E-3},{"$f":"+I$7*I120+K$7*K120+M$7*M120+O$7*O120+Q$7*Q120","v":1.3591941564529623E-3},null,null,{"$f":"ROUND(+$R120*U$6,0)","v":38},null,null,{"$f":"ROUND(+$R120*X$6,0)","v":43},null,null,{"$f":"ROUND(+$R120*AA$6,0)","v":49},null,null,{"$f":"ROUND(+$R120*AD$6,0)","v":26}]
["4C",94,{"$f":"RANK($G121,$G$44:$G$152,1)+36","v":135},{"$f":"INDEX(BFnames,MATCH(B121,Lookups!A$2:A$145,0),2)","v":"Anthony Marchesani"},null,null,{"$f":"INDEX(BFnames,MATCH(B121,Lookups!A$2:A$145,0),4)","v":1100},{"$f":"IF(G121<>\"Scr\",1/G121,\"\")","v":9.0909090909090909E-4},{"$f":"IF(H121<>\"\",+H121/$H$153,0)","v":8.2283929287245428E-4},{"$f":"(1-I121)*I121/(1-I121/92)","v":8.2216958177748652E-4},{"$f":"IF(J121<>\"\",+J121/$J$153,0)","v":8.5824106839187033E-4},{"$f":"(1-I121-K121)*(I121+K121)/(1-(I121+K121)/92)","v":1.6782849967349116E-3},{"$f":"IF(L121<>\"\",+L121/$L$153,0)","v":9.133281684013503E-4},{"$f":"(1-I121-K121-M121)*(I121+K121+M121)/(1-(I121+K121+M121)/92)","v":2.5877505488522707E-3},{"$f":"IF(N121<>\"\",+N121/$N$153,0)","v":9.7611014500844078E-4},{"$f":"(1-I121-K121-M121-O121)*(I121+K121+M121+O121)/(1-(I121+K121+M121+O121)/92)","v":3.5579081534320997E-3},{"$f":"IF(P121<>\"\",+P121/$P$153,0)","v":1.0430056200707606E-3},{"$f":"+I$7*I121+K$7*K121+M$7*M121+O$7*O121+Q$7*Q121","v":8.7297564715539352E-4},null,null,{"$f":"ROUND(+$R121*U$6,0)","v":24},null,null,{"$f":"ROUND(+$R121*X$6,0)","v":28},null,null,{"$f":"ROUND(+$R121*AA$6,0)","v":31},null,null,{"$f":"ROUND(+$R121*AD$6,0)","v":17}]
["4C",97,{"$f":"RANK($G122,$G$44:$G$152,1)+36","v":96},{"$f":"INDEX(BFnames,MATCH(B122,Lookups!A$2:A$145,0),2)","v":"Kieran Muir"},null,null,{"$f":"INDEX(BFnames,MATCH(B122,Lookups!A$2:A$145,0),4)","v":491},{"$f":"IF(G122<>\"Scr\",1/G122,\"\")","v":2.0366598778004071E-3},{"$f":"IF(H122<>\"\",+H122/$H$153,0)","v":1.8434281510380849E-3},{"$f":"(1-I122)*I122/(1-I122/92)","v":1.8400667935914267E-3},{"$f":"IF(J122<>\"\",+J122/$J$153,0)","v":1.9207970300118844E-3},{"$f":"(1-I122-K122)*(I122+K122)/(1-(I122+K122)/92)","v":3.7502092314887466E-3},{"$f":"IF(L122<>\"\",+L122/$L$153,0)","v":2.0408760938583695E-3},{"$f":"(1-I122-K122-M122)*(I122+K122+M122)/(1-(I122+K122+M122)/92)","v":5.7717662663541282E-3},{"$f":"IF(N122<>\"\",+N122/$N$153,0)","v":2.177133962817442E-3},{"$f":"(1-I122-K122-M122-O122)*(I122+K122+M122+O122)/(1-(I122+K122+M122+O122)/92)","v":7.9192062558052796E-3},{"$f":"IF(P122<>\"\",+P122/$P$153,0)","v":2.3215260976697004E-3},{"$f":"+I$7*I122+K$7*K122+M$7*M122+O$7*O122+Q$7*Q122","v":1.952665017310256E-3},null,null,{"$f":"ROUND(+$R122*U$6,0)","v":55},null,null,{"$f":"ROUND(+$R122*X$6,0)","v":62},null,null,{"$f":"ROUND(+$R122*AA$6,0)","v":70},null,null,{"$f":"ROUND(+$R122*AD$6,0)","v":37}]
["4C",101,{"$f":"RANK($G123,$G$44:$G$152,1)+36","v":101},{"$f":"INDEX(BFnames,MATCH(B123,Lookups!A$2:A$145,0),2)","v":"Max McCardle"},null,null,{"$f":"INDEX(BFnames,MATCH(B123,Lookups!A$2:A$145,0),4)","v":579.61538461538464},{"$f":"IF(G123<>\"Scr\",1/G123,\"\")","v":1.7252820172528201E-3},{"$f":"IF(H123<>\"\",+H123/$H$153,0)","v":1.5615928185900591E-3},{"$f":"(1-I123)*I123/(1-I123/92)","v":1.5591807117350995E-3},{"$f":"IF(J123<>\"\",+J123/$J$153,0)","v":1.6275874825756916E-3},{"$f":"(1-I123-K123)*(I123+K123)/(1-(I123+K123)/92)","v":3.1791196343649393E-3},{"$f":"IF(L123<>\"\",+L123/$L$153,0)","v":1.7300872726814507E-3},{"$f":"(1-I123-K123-M123)*(I123+K123+M123)/(1-(I123+K123+M123)/92)","v":4.8953301351536312E-3},{"$f":"IF(N123<>\"\",+N123/$N$153,0)","v":1.8465386511881245E-3},{"$f":"(1-I123-K123-M123-O123)*(I123+K123+M123+O123)/(1-(I123+K123+M123+O123)/92)","v":6.720524327740297E-3},{"$f":"IF(P123<>\"\",+P123/$P$153,0)","v":1.9701308581824167E-3},{"$f":"+I$7*I123+K$7*K123+M$7*M123+O$7*O123+Q$7*Q123","v":1.6548496326922444E-3},null,null,{"$f":"ROUND(+$R123*U$6,0)","v":46},null,null,{"$f":"ROUND(+$R123*X$6,0)","v":53},null,null,{"$f":"ROUND(+$R123*AA$6,0)","v":60},null,null,{"$f":"ROUND(+$R123*AD$6,0)","v":32}]
["4C",104,{"$f":"RANK($G124,$G$44:$G$152,1)+36","v":124},{"$f":"INDEX(BFnames,MATCH(B124,Lookups!A$2:A$145,0),2)","v":"James Marchesani"},null,null,{"$f":"INDEX(BFnames,MATCH(B124,Lookups!A$2:A$145,0),4)","v":858.9655172413793},{"$f":"IF(G124<>\"Scr\",1/G124,\"\")","v":1.1641910879164994E-3},{"$f":"IF(H124<>\"\",+H124/$H$153,0)","v":1.053736388704588E-3},{"$f":"(1-I124)*I124/(1-I124/92)","v":1.0526380848826446E-3},{"$f":"IF(J124<>\"\",+J124/$J$153,0)","v":1.0988210396284835E-3},{"$f":"(1-I124-K124)*(I124+K124)/(1-(I124+K124)/92)","v":2.1479741817832009E-3},{"$f":"IF(L124<>\"\",+L124/$L$153,0)","v":1.1689345546424563E-3},{"$f":"(1-I124-K124-M124)*(I124+K124+M124)/(1-(I124+K124+M124)/92)","v":3.310579196398425E-3},{"$f":"IF(N124<>\"\",+N124/$N$153,0)","v":1.2487640823384762E-3},{"$f":"(1-I124-K124-M124-O124)*(I124+K124+M124+O124)/(1-(I124+K124+M124+O124)/92)","v":4.5495948336525876E-3},{"$f":"IF(P124<>\"\",+P124/$P$153,0)","v":1.3337199207818467E-3},{"$f":"+I$7*I124+K$7*K124+M$7*M124+O$7*O124+Q$7*Q124","v":1.117542060168843E-3},null,null,{"$f":"ROUND(+$R124*U$6,0)","v":31},null,null,{"$f":"ROUND(+$R124*X$6,0)","v":36},null,null,{"$f":"ROUND(+$R124*AA$6,0)","v":40},null,null,{"$f":"ROUND(+$R124*AD$6,0)","v":21}]
["4C",105,{"$f":"RANK($G125,$G$44:$G$152,1)+36","v":120},{"$f":"INDEX(BFnames,MATCH(B125,Lookups!A$2:A$145,0),2)","v":"Andrew Martin"},null,null,{"$f":"INDEX(BFnames,MATCH(B125,Lookups!A$2:A$145,0),4)","v":847.82608695652175},{"$f":"IF(G125<>\"Scr\",1/G125,\"\")","v":1.1794871794871796E-3},{"$f":"IF(H125<>\"\",+H125/$H$153,0)","v":1.067581236393492E-3},{"$f":"(1-I125)*I125/(1-I125/92)","v":1.0664538819814737E-3},{"$f":"IF(J125<>\"\",+J125/$J$153,0)","v":1.113242984596515E-3},{"$f":"(1-I125-K125)*(I125+K125)/(1-(I125+K125)/92)","v":2.1761198107809673E-3},{"$f":"IF(L125<>\"\",+L125/$L$153,0)","v":1.1842514977308143E-3},{"$f":"(1-I125-K125-M125)*(I125+K125+M125)/(1-(I125+K125+M125)/92)","v":3.3538746584995853E-3},{"$f":"IF(N125<>\"\",+N125/$N$153,0)","v":1.2650953086263093E-3},{"$f":"(1-I125-K125-M125-O125)*(I125+K125+M125+O125)/(1-(I125+K125+M125+O125)/92)","v":4.6089645033210516E-3},{"$f":"IF(P125<>\"\",+P125/$P$153,0)","v":1.3511242202903146E-3},{"$f":"+I$7*I125+K$7*K125+M$7*M125+O$7*O125+Q$7*Q125","v":1.1322009818913264E-3},null,null,{"$f":"ROUND(+$R125*U$6,0)","v":32},null,null,{"$f":"ROUND(+$R125*X$6,0)","v":36},null,null,{"$f":"ROUND(+$R125*AA$6,0)","v":41},null,null,{"$f":"ROUND(+$R125*AD$6,0)","v":22}]
["4C",106,{"$f":"RANK($G126,$G$44:$G$152,1)+36","v":126},{"$f":"INDEX(BFnames,MATCH(B126,Lookups!A$2:A$145,0),2)","v":"Daniel Nisbet"},null,null,{"$f":"INDEX(BFnames,MATCH(B126,Lookups!A$2:A$145,0),4)","v":864.19354838709683},{"$f":"IF(G126<>\"Scr\",1/G126,\"\")","v":1.1571481896229935E-3},{"$f":"IF(H126<>\"\",+H126/$H$153,0)","v":1.0473616979078271E-3},{"$f":"(1-I126)*I126/(1-I126/92)","v":1.0462766425781138E-3},{"$f":"IF(J126<>\"\",+J126/$J$153,0)","v":1.0921804983569975E-3},{"$f":"(1-I126-K126)*(I126+K126)/(1-(I126+K126)/92)","v":2.1350142071181154E-3},{"$f":"IF(L126<>\"\",+L126/$L$153,0)","v":1.1618816941649935E-3},{"$f":"(1-I126-K126-M126)*(I126+K126+M126)/(1-(I126+K126+M126)/92)","v":3.2906425755734937E-3},{"$f":"IF(N126<>\"\",+N126/$N$153,0)","v":1.2412439070058757E-3},{"$f":"(1-I126-K126-M126-O126)*(I126+K126+M126+O126)/(1-(I126+K126+M126+O126)/92)","v":4.5222552613194368E-3},{"$f":"IF(P126<>\"\",+P126/$P$153,0)","v":1.3257052879234071E-3},{"$f":"+I$7*I126+K$7*K126+M$7*M126+O$7*O126+Q$7*Q126","v":1.1107923277644785E-3},null,null,{"$f":"ROUND(+$R126*U$6,0)","v":31},null,null,{"$f":"ROUND(+$R126*X$6,0)","v":36},null,null,{"$f":"ROUND(+$R126*AA$6,0)","v":40},null,null,{"$f":"ROUND(+$R126*AD$6,0)","v":21}]
["4C",108,{"$f":"RANK($G127,$G$44:$G$152,1)+36","v":115},{"$f":"INDEX(BFnames,MATCH(B127,Lookups!A$2:A$145,0),2)","v":"James Nitties"},null,null,{"$f":"INDEX(BFnames,MATCH(B127,Lookups!A$2:A$145,0),4)","v":734},{"$f":"IF(G127<>\"Scr\",1/G127,\"\")","v":1.3623978201634877E-3},{"$f":"IF(H127<>\"\",+H127/$H$153,0)","v":1.2331379048497271E-3},{"$f":"(1-I127)*I127/(1-I127/92)","v":1.2316337841736995E-3},{"$f":"IF(J127<>\"\",+J127/$J$153,0)","v":1.285669913147963E-3},{"$f":"(1-I127-K127)*(I127+K127)/(1-(I127+K127)/92)","v":2.5125322141495965E-3},{"$f":"IF(L127<>\"\",+L127/$L$153,0)","v":1.367328224743168E-3},{"$f":"(1-I127-K127-M127)*(I127+K127+M127)/(1-(I127+K127+M127)/92)","v":3.8711975111392189E-3},{"$f":"IF(N127<>\"\",+N127/$N$153,0)","v":1.4602316153040208E-3},{"$f":"(1-I127-K127-M127-O127)*(I127+K127+M127+O127)/(1-(I127+K127+M127+O127)/92)","v":5.3180930596135462E-3},{"$f":"IF(P127<>\"\",+P127/$P$153,0)","v":1.5590062222054751E-3},{"$f":"+I$7*I127+K$7*K127+M$7*M127+O$7*O127+Q$7*Q127","v":1.3074436996113991E-3},null,null,{"$f":"ROUND(+$R127*U$6,0)","v":37},null,null,{"$f":"ROUND(+$R127*X$6,0)","v":42},null,null,{"$f":"ROUND(+$R127*AA$6,0)","v":47},null,null,{"$f":"ROUND(+$R127*AD$6,0)","v":25}]
["4C",110,{"$f":"RANK($G128,$G$44:$G$152,1)+36","v":129},{"$f":"INDEX(BFnames,MATCH(B128,Lookups!A$2:A$145,0),2)","v":"Peter OMalley"},null,null,{"$f":"INDEX(BFnames,MATCH(B128,Lookups!A$2:A$145,0),4)","v":906},{"$f":"IF(G128<>\"Scr\",1/G128,\"\")","v":1.1037527593818985E-3},{"$f":"IF(H128<>\"\",+H128/$H$153,0)","v":9.9903225403940362E-4},{"$f":"(1-I128)*I128/(1-I128/92)","v":9.9804502641188367E-4},{"$f":"IF(J128<>\"\",+J128/$J$153,0)","v":1.0418327906501768E-3},{"$f":"(1-I128-K128)*(I128+K128)/(1-(I128+K128)/92)","v":2.0367450963184228E-3},{"$f":"IF(L128<>\"\",+L128/$L$153,0)","v":1.108403323595201E-3},{"$f":"(1-I128-K128-M128)*(I128+K128+M128)/(1-(I128+K128+M128)/92)","v":3.1394579443727562E-3},{"$f":"IF(N128<>\"\",+N128/$N$153,0)","v":1.1842164426121955E-3},{"$f":"(1-I128-K128-M128-O128)*(I128+K128+M128+O128)/(1-(I128+K128+M128+O128)/92)","v":4.3149089658609616E-3},{"$f":"IF(P128<>\"\",+P128/$P$153,0)","v":1.2649214390611405E-3},{"$f":"+I$7*I128+K$7*K128+M$7*M128+O$7*O128+Q$7*Q128","v":1.0596151900574581E-3},null,null,{"$f":"ROUND(+$R128*U$6,0)","v":30},null,null,{"$f":"ROUND(+$R128*X$6,0)","v":34},null,null,{"$f":"ROUND(+$R128*AA$6,0)","v":38},null,null,{"$f":"ROUND(+$R128*AD$6,0)","v":20}]
["4C",111,{"$f":"RANK($G129,$G$44:$G$152,1)+36","v":73},{"$f":"INDEX(BFnames,MATCH(B129,Lookups!A$2:A$145,0),2)","v":"Nick OHern"},null,null,{"$f":"INDEX(BFnames,MATCH(B129,Lookups!A$2:A$145,0),4)","v":397},{"$f":"IF(G129<>\"Scr\",1/G129,\"\")","v":2.5188916876574307E-3},{"$f":"IF(H129<>\"\",+H129/$H$153,0)","v":2.2799073606037776E-3},{"$f":"(1-I129)*I129/(1-I129/92)","v":2.2747657553698567E-3},{"$f":"IF(J129<>\"\",+J129/$J$153,0)","v":2.3745677722704158E-3},{"$f":"(1-I129-K129)*(I129+K129)/(1-(I129+K129)/92)","v":4.6330453897046476E-3},{"$f":"IF(L129<>\"\",+L129/$L$153,0)","v":2.5213184102411651E-3},{"$f":"(1-I129-K129-M129)*(I129+K129+M129)/(1-(I129+K129+M129)/92)","v":7.12485725301881E-3},{"$f":"IF(N129<>\"\",+N129/$N$153,0)","v":2.6875254454078595E-3},{"$f":"(1-I129-K129-M129-O129)*(I129+K129+M129+O129)/(1-(I129+K129+M129+O129)/92)","v":9.7670810557064537E-3},{"$f":"IF(P129<>\"\",+P129/$P$153,0)","v":2.8632331115578651E-3},{"$f":"+I$7*I129+K$7*K129+M$7*M129+O$7*O129+Q$7*Q129","v":2.4133809829434264E-3},null,null,{"$f":"ROUND(+$R129*U$6,0)","v":68},null,null,{"$f":"ROUND(+$R129*X$6,0)","v":77},null,null,{"$f":"ROUND(+$R129*AA$6,0)","v":87},null,null,{"$f":"ROUND(+$R129*AD$6,0)","v":46}]
["4C",113,{"$f":"RANK($G130,$G$44:$G$152,1)+36","v":77},{"$f":"INDEX(BFnames,MATCH(B130,Lookups!A$2:A$145,0),2)","v":"Brett Rankin"},null,null,{"$f":"INDEX(BFnames,MATCH(B130,Lookups!A$2:A$145,0),4)","v":407},{"$f":"IF(G130<>\"Scr\",1/G130,\"\")","v":2.4570024570024569E-3},{"$f":"IF(H130<>\"\",+H130/$H$153,0)","v":2.2238899807363629E-3},{"$f":"(1-I130)*I130/(1-I130/92)","v":2.2189979332994125E-3},{"$f":"IF(J130<>\"\",+J130/$J$153,0)","v":2.316353218659529E-3},{"$f":"(1-I130-K130)*(I130+K130)/(1-(I130+K130)/92)","v":4.5198524479268722E-3},{"$f":"IF(L130<>\"\",+L130/$L$153,0)","v":2.4597184421839007E-3},{"$f":"(1-I130-K130-M130)*(I130+K130+M130)/(1-(I130+K130+M130)/92)","v":6.9514910934984448E-3},{"$f":"IF(N130<>\"\",+N130/$N$153,0)","v":2.6221310173459912E-3},{"$f":"(1-I130-K130-M130-O130)*(I130+K130+M130+O130)/(1-(I130+K130+M130+O130)/92)","v":9.53050476787538E-3},{"$f":"IF(P130<>\"\",+P130/$P$153,0)","v":2.7938804506283631E-3},{"$f":"+I$7*I130+K$7*K130+M$7*M130+O$7*O130+Q$7*Q130","v":2.3542878171779569E-3},null,null,{"$f":"ROUND(+$R130*U$6,0)","v":66},null,null,{"$f":"ROUND(+$R130*X$6,0)","v":75},null,null,{"$f":"ROUND(+$R130*AA$6,0)","v":85},null,null,{"$f":"ROUND(+$R130*AD$6,0)","v":45}]
["4D",115,{"$f":"RANK($G131,$G$44:$G$152,1)+36","v":82},{"$f":"INDEX(BFnames,MATCH(B131,Lookups!A$2:A$145,0),2)","v":"Craig Parry"},null,null,{"$f":"INDEX(BFnames,MATCH(B131,Lookups!A$2:A$145,0),4)","v":415},{"$f":"IF(G131<>\"Scr\",1/G131,\"\")","v":2.4096385542168677E-3},{"$f":"IF(H131<>\"\",+H131/$H$153,0)","v":2.1810198124330117E-3},{"$f":"(1-I131)*I131/(1-I131/92)","v":2.1763145583278496E-3},{"$f":"IF(J131<>\"\",+J131/$J$153,0)","v":2.2717971731062905E-3},{"$f":"(1-I131-K131)*(I131+K131)/(1-(I131+K131)/92)","v":4.4332039743234346E-3},{"$f":"IF(L131<>\"\",+L131/$L$153,0)","v":2.412564060273222E-3},{"$f":"(1-I131-K131-M131)*(I131+K131+M131)/(1-(I131+K131+M131)/92)","v":6.8187564297903774E-3},{"$f":"IF(N131<>\"\",+N131/$N$153,0)","v":2.5720629565365006E-3},{"$f":"(1-I131-K131-M131-O131)*(I131+K131+M131+O131)/(1-(I131+K131+M131+O131)/92)","v":9.3493377166511162E-3},{"$f":"IF(P131<>\"\",+P131/$P$153,0)","v":2.7407710828622847E-3},{"$f":"+I$7*I131+K$7*K131+M$7*M131+O$7*O131+Q$7*Q131","v":2.3090568398883488E-3},null,null,{"$f":"ROUND(+$R131*U$6,0)","v":65},null,null,{"$f":"ROUND(+$R131*X$6,0)","v":74},null,null,{"$f":"ROUND(+$R131*AA$6,0)","v":83},null,null,{"$f":"ROUND(+$R131*AD$6,0)","v":44}]
["4D",116,{"$f":"RANK($G132,$G$44:$G$152,1)+36","v":109},{"$f":"INDEX(BFnames,MATCH(B132,Lookups!A$2:A$145,0),2)","v":"Gareth Paddison"},null,null,{"$f":"INDEX(BFnames,MATCH(B132,Lookups!A$2:A$145,0),4)","v":706.20689655172418},{"$f":"IF(G132<>\"Scr\",1/G132,\"\")","v":1.416015625E-3},{"$f":"IF(H132<>\"\",+H132/$H$153,0)","v":1.281668625128481E-3},{"$f":"(1-I132)*I132/(1-I132/92)","v":1.2800437831850999E-3},{"$f":"IF(J132<>\"\",+J132/$J$153,0)","v":1.336203829986105E-3},{"$f":"(1-I132-K132)*(I132+K132)/(1-(I132+K132)/92)","v":2.6110934979423164E-3},{"$f":"IF(L132<>\"\",+L132/$L$153,0)","v":1.4209655968085927E-3},{"$f":"(1-I132-K132-M132)*(I132+K132+M132)/(1-(I132+K132+M132)/92)","v":4.0227024374143404E-3},{"$f":"IF(N132<>\"\",+N132/$N$153,0)","v":1.5173798963164595E-3},{"$f":"(1-I132-K132-M132-O132)*(I132+K132+M132+O132)/(1-(I132+K132+M132+O132)/92)","v":5.5256801064706871E-3},{"$f":"IF(P132<>\"\",+P132/$P$153,0)","v":1.6198606476680974E-3},{"$f":"+I$7*I132+K$7*K132+M$7*M132+O$7*O132+Q$7*Q132","v":1.3587967445112448E-3},null,null,{"$f":"ROUND(+$R132*U$6,0)","v":38},null,null,{"$f":"ROUND(+$R132*X$6,0)","v":43},null,null,{"$f":"ROUND(+$R132*AA$6,0)","v":49},null,null,{"$f":"ROUND(+$R132*AD$6,0)","v":26}]
["4D",117,{"$f":"RANK($G133,$G$44:$G$152,1)+36","v":96},{"$f":"INDEX(BFnames,MATCH(B133,Lookups!A$2:A$145,0),2)","v":"Daniel Pearce"},null,null,{"$f":"INDEX(BFnames,MATCH(B133,Lookups!A$2:A$145,0),4)","v":491},{"$f":"IF(G133<>\"Scr\",1/G133,\"\")","v":2.0366598778004071E-3},{"$f":"IF(H133<>\"\",+H133/$H$153,0)","v":1.8434281510380849E-3},{"$f":"(1-I133)*I133/(1-I133/92)","v":1.8400667935914267E-3},{"$f":"IF(J133<>\"\",+J133/$J$153,0)","v":1.9207970300118844E-3},{"$f":"(1-I133-K133)*(I133+K133)/(1-(I133+K133)/92)","v":3.7502092314887466E-3},{"$f":"IF(L133<>\"\",+L133/$L$153,0)","v":2.0408760938583695E-3},{"$f":"(1-I133-K133-M133)*(I133+K133+M133)/(1-(I133+K133+M133)/92)","v":5.7717662663541282E-3},{"$f":"IF(N133<>\"\",+N133/$N$153,0)","v":2.177133962817442E-3},{"$f":"(1-I133-K133-M133-O133)*(I133+K133+M133+O133)/(1-(I133+K133+M133+O133)/92)","v":7.9192062558052796E-3},{"$f":"IF(P133<>\"\",+P133/$P$153,0)","v":2.3215260976697004E-3},{"$f":"+I$7*I133+K$7*K133+M$7*M133+O$7*O133+Q$7*Q133","v":1.952665017310256E-3},null,null,{"$f":"ROUND(+$R133*U$6,0)","v":55},null,null,{"$f":"ROUND(+$R133*X$6,0)","v":62},null,null,{"$f":"ROUND(+$R133*AA$6,0)","v":70},null,null,{"$f":"ROUND(+$R133*AD$6,0)","v":37}]
["4D",118,{"$f":"RANK($G134,$G$44:$G$152,1)+36","v":85},{"$f":"INDEX(BFnames,MATCH(B134,Lookups!A$2:A$145,0),2)","v":"Mathew Perry"},null,null,{"$f":"INDEX(BFnames,MATCH(B134,Lookups!A$2:A$145,0),4)","v":419},{"$f":"IF(G134<>\"Scr\",1/G134,\"\")","v":2.3866348448687352E-3},{"$f":"IF(H134<>\"\",+H134/$H$153,0)","v":2.1601986209062048E-3},{"$f":"(1-I134)*I134/(1-I134/92)","v":2.1555827768129365E-3},{"$f":"IF(J134<>\"\",+J134/$J$153,0)","v":2.2501558150320126E-3},{"$f":"(1-I134-K134)*(I134+K134)/(1-(I134+K134)/92)","v":4.3911137136859422E-3},{"$f":"IF(L134<>\"\",+L134/$L$153,0)","v":2.3896584031706646E-3},{"$f":"(1-I134-K134-M134)*(I134+K134+M134)/(1-(I134+K134+M134)/92)","v":6.7542718942316168E-3},{"$f":"IF(N134<>\"\",+N134/$N$153,0)","v":2.5477391246343179E-3},{"$f":"(1-I134-K134-M134-O134)*(I134+K134+M134+O134)/(1-(I134+K134+M134+O134)/92)","v":9.2613125018819534E-3},{"$f":"IF(P134<>\"\",+P134/$P$153,0)","v":2.7149663712865775E-3},{"$f":"+I$7*I134+K$7*K134+M$7*M134+O$7*O134+Q$7*Q134","v":2.2870868893726218E-3},null,null,{"$f":"ROUND(+$R134*U$6,0)","v":64},null,null,{"$f":"ROUND(+$R134*X$6,0)","v":73},null,null,{"$f":"ROUND(+$R134*AA$6,0)","v":82},null,null,{"$f":"ROUND(+$R134*AD$6,0)","v":44}]
["4D",124,{"$f":"RANK($G135,$G$44:$G$152,1)+36","v":83},{"$f":"INDEX(BFnames,MATCH(B135,Lookups!A$2:A$145,0),2)","v":"Ruben Sondjaja"},null,null,{"$f":"INDEX(BFnames,MATCH(B135,Lookups!A$2:A$145,0),4)","v":416},{"$f":"IF(G135<>\"Scr\",1/G135,\"\")","v":2.403846153846154E-3},{"$f":"IF(H135<>\"\",+H135/$H$153,0)","v":2.1757769763454319E-3},{"$f":"(1-I135)*I135/(1-I135/92)","v":2.1710943167318961E-3},{"$f":"IF(J135<>\"\",+J135/$J$153,0)","v":2.2663479010535726E-3},{"$f":"(1-I135-K135)*(I135+K135)/(1-(I135+K135)/92)","v":4.4226059449279332E-3},{"$f":"IF(L135<>\"\",+L135/$L$153,0)","v":2.4067965781141799E-3},{"$f":"(1-I135-K135-M135)*(I135+K135+M135)/(1-(I135+K135+M135)/92)","v":6.802520142650227E-3},{"$f":"IF(N135<>\"\",+N135/$N$153,0)","v":2.5659385622814977E-3},{"$f":"(1-I135-K135-M135-O135)*(I135+K135+M135+O135)/(1-(I135+K135+M135+O135)/92)","v":9.3271749291434849E-3},{"$f":"IF(P135<>\"\",+P135/$P$153,0)","v":2.7342740315248028E-3},{"$f":"+I$7*I135+K$7*K135+M$7*M135+O$7*O135+Q$7*Q135","v":2.3035248760668696E-3},null,null,{"$f":"ROUND(+$R135*U$6,0)","v":64},null,null,{"$f":"ROUND(+$R135*X$6,0)","v":74},null,null,{"$f":"ROUND(+$R135*AA$6,0)","v":83},null,null,{"$f":"ROUND(+$R135*AD$6,0)","v":44}]
["4D",125,{"$f":"RANK($G136,$G$44:$G$152,1)+36","v":80},{"$f":"INDEX(BFnames,MATCH(B136,Lookups!A$2:A$145,0),2)","v":"Robby Shelton"},null,null,{"$f":"INDEX(BFnames,MATCH(B136,Lookups!A$2:A$145,0),4)","v":409.47368421052636},{"$f":"IF(G136<>\"Scr\",1/G136,\"\")","v":2.442159383033419E-3},{"$f":"IF(H136<>\"\",+H136/$H$153,0)","v":2.2104551697987524E-3},{"$f":"(1-I136)*I136/(1-I136/92)","v":2.2056220515309149E-3},{"$f":"IF(J136<>\"\",+J136/$J$153,0)","v":2.302390489662842E-3},{"$f":"(1-I136-K136)*(I136+K136)/(1-(I136+K136)/92)","v":4.492700262459807E-3},{"$f":"IF(L136<>\"\",+L136/$L$153,0)","v":2.4449421343047417E-3},{"$f":"(1-I136-K136-M136)*(I136+K136+M136)/(1-(I136+K136+M136)/92)","v":6.9098995655533964E-3},{"$f":"IF(N136<>\"\",+N136/$N$153,0)","v":2.6064425220265444E-3},{"$f":"(1-I136-K136-M136-O136)*(I136+K136+M136+O136)/(1-(I136+K136+M136+O136)/92)","v":9.4737406951067391E-3},{"$f":"IF(P136<>\"\",+P136/$P$153,0)","v":2.7772399853991845E-3},{"$f":"+I$7*I136+K$7*K136+M$7*M136+O$7*O136+Q$7*Q136","v":2.3401138115595218E-3},null,null,{"$f":"ROUND(+$R136*U$6,0)","v":66},null,null,{"$f":"ROUND(+$R136*X$6,0)","v":75},null,null,{"$f":"ROUND(+$R136*AA$6,0)","v":84},null,null,{"$f":"ROUND(+$R136*AD$6,0)","v":45}]
["4D",126,{"$f":"RANK($G137,$G$44:$G$152,1)+36","v":127},{"$f":"INDEX(BFnames,MATCH(B137,Lookups!A$2:A$145,0),2)","v":"Michael Sim"},null,null,{"$f":"INDEX(BFnames,MATCH(B137,Lookups!A$2:A$145,0),4)","v":872.58064516129036},{"$f":"IF(G137<>\"Scr\",1/G137,\"\")","v":1.1460258780036968E-3},{"$f":"IF(H137<>\"\",+H137/$H$153,0)","v":1.0372946353771049E-3},{"$f":"(1-I137)*I137/(1-I137/92)","v":1.0362303386531673E-3},{"$f":"IF(J137<>\"\",+J137/$J$153,0)","v":1.0816934275567193E-3},{"$f":"(1-I137-K137)*(I137+K137)/(1-(I137+K137)/92)","v":2.1145466557742957E-3},{"$f":"IF(L137<>\"\",+L137/$L$153,0)","v":1.1507431859754549E-3},{"$f":"(1-I137-K137-M137)*(I137+K137+M137)/(1-(I137+K137+M137)/92)","v":3.2591559386867704E-3},{"$f":"IF(N137<>\"\",+N137/$N$153,0)","v":1.229367018133817E-3},{"$f":"(1-I137-K137-M137-O137)*(I137+K137+M137+O137)/(1-(I137+K137+M137+O137)/92)","v":4.4790754231360886E-3},{"$f":"IF(P137<>\"\",+P137/$P$153,0)","v":1.3130470595608974E-3},{"$f":"+I$7*I137+K$7*K137+M$7*M137+O$7*O137+Q$7*Q137","v":1.1001327194570902E-3},null,null,{"$f":"ROUND(+$R137*U$6,0)","v":31},null,null,{"$f":"ROUND(+$R137*X$6,0)","v":35},null,null,{"$f":"ROUND(+$R137*AA$6,0)","v":40},null,null,{"$f":"ROUND(+$R137*AD$6,0)","v":21}]
["4D",127,{"$f":"RANK($G138,$G$44:$G$152,1)+36","v":105},{"$f":"INDEX(BFnames,MATCH(B138,Lookups!A$2:A$145,0),2)","v":"Peter Senior"},null,null,{"$f":"INDEX(BFnames,MATCH(B138,Lookups!A$2:A$145,0),4)","v":622.17391304347825},{"$f":"IF(G138<>\"Scr\",1/G138,\"\")","v":1.6072676450034941E-3},{"$f":"IF(H138<>\"\",+H138/$H$153,0)","v":1.4547752697185948E-3},{"$f":"(1-I138)*I138/(1-I138/92)","v":1.4526818695642821E-3},{"$f":"IF(J138<>\"\",+J138/$J$153,0)","v":1.5164161596357528E-3},{"$f":"(1-I138-K138)*(I138+K138)/(1-(I138+K138)/92)","v":2.9624591251179834E-3},{"$f":"IF(L138<>\"\",+L138/$L$153,0)","v":1.6121799169817907E-3},{"$f":"(1-I138-K138-M138)*(I138+K138+M138)/(1-(I138+K138+M138)/92)","v":4.5625913583344294E-3},{"$f":"IF(N138<>\"\",+N138/$N$153,0)","v":1.7210282167163884E-3},{"$f":"(1-I138-K138-M138-O138)*(I138+K138+M138+O138)/(1-(I138+K138+M138+O138)/92)","v":6.2650834308241249E-3},{"$f":"IF(P138<>\"\",+P138/$P$153,0)","v":1.836617739066229E-3},{"$f":"+I$7*I138+K$7*K138+M$7*M138+O$7*O138+Q$7*Q138","v":1.5419077013881758E-3},null,null,{"$f":"ROUND(+$R138*U$6,0)","v":43},null,null,{"$f":"ROUND(+$R138*X$6,0)","v":49},null,null,{"$f":"ROUND(+$R138*AA$6,0)","v":56},null,null,{"$f":"ROUND(+$R138*AD$6,0)","v":29}]
["4D",128,{"$f":"RANK($G139,$G$44:$G$152,1)+36","v":122},{"$f":"INDEX(BFnames,MATCH(B139,Lookups!A$2:A$145,0),2)","v":"Matthew Stieger"},null,null,{"$f":"INDEX(BFnames,MATCH(B139,Lookups!A$2:A$145,0),4)","v":850},{"$f":"IF(G139<>\"Scr\",1/G139,\"\")","v":1.176470588235294E-3},{"$f":"IF(H139<>\"\",+H139/$H$153,0)","v":1.0648508495996467E-3},{"$f":"(1-I139)*I139/(1-I139/92)","v":1.0637292543655824E-3},{"$f":"IF(J139<>\"\",+J139/$J$153,0)","v":1.1103988179332616E-3},{"$f":"(1-I139-K139)*(I139+K139)/(1-(I139+K139)/92)","v":2.1705692773961432E-3},{"$f":"IF(L139<>\"\",+L139/$L$153,0)","v":1.1812308793615418E-3},{"$f":"(1-I139-K139-M139)*(I139+K139+M139)/(1-(I139+K139+M139)/92)","v":3.3453366347690455E-3},{"$f":"IF(N139<>\"\",+N139/$N$153,0)","v":1.2618747309761959E-3},{"$f":"(1-I139-K139-M139-O139)*(I139+K139+M139+O139)/(1-(I139+K139+M139+O139)/92)","v":4.5972568524572308E-3},{"$f":"IF(P139<>\"\",+P139/$P$153,0)","v":1.3476921064969859E-3},{"$f":"+I$7*I139+K$7*K139+M$7*M139+O$7*O139+Q$7*Q139","v":1.1293100986655635E-3},null,null,{"$f":"ROUND(+$R139*U$6,0)","v":32},null,null,{"$f":"ROUND(+$R139*X$6,0)","v":36},null,null,{"$f":"ROUND(+$R139*AA$6,0)","v":41},null,null,{"$f":"ROUND(+$R139*AD$6,0)","v":22}]
["4D",129,{"$f":"RANK($G140,$G$44:$G$152,1)+36","v":77},{"$f":"INDEX(BFnames,MATCH(B140,Lookups!A$2:A$145,0),2)","v":"Scott Strange"},null,null,{"$f":"INDEX(BFnames,MATCH(B140,Lookups!A$2:A$145,0),4)","v":407},{"$f":"IF(G140<>\"Scr\",1/G140,\"\")","v":2.4570024570024569E-3},{"$f":"IF(H140<>\"\",+H140/$H$153,0)","v":2.2238899807363629E-3},{"$f":"(1-I140)*I140/(1-I140/92)","v":2.2189979332994125E-3},{"$f":"IF(J140<>\"\",+J140/$J$153,0)","v":2.316353218659529E-3},{"$f":"(1-I140-K140)*(I140+K140)/(1-(I140+K140)/92)","v":4.5198524479268722E-3},{"$f":"IF(L140<>\"\",+L140/$L$153,0)","v":2.4597184421839007E-3},{"$f":"(1-I140-K140-M140)*(I140+K140+M140)/(1-(I140+K140+M140)/92)","v":6.9514910934984448E-3},{"$f":"IF(N140<>\"\",+N140/$N$153,0)","v":2.6221310173459912E-3},{"$f":"(1-I140-K140-M140-O140)*(I140+K140+M140+O140)/(1-(I140+K140+M140+O140)/92)","v":9.53050476787538E-3},{"$f":"IF(P140<>\"\",+P140/$P$153,0)","v":2.7938804506283631E-3},{"$f":"+I$7*I140+K$7*K140+M$7*M140+O$7*O140+Q$7*Q140","v":2.3542878171779569E-3},null,null,{"$f":"ROUND(+$R140*U$6,0)","v":66},null,null,{"$f":"ROUND(+$R140*X$6,0)","v":75},null,null,{"$f":"ROUND(+$R140*AA$6,0)","v":85},null,null,{"$f":"ROUND(+$R140*AD$6,0)","v":45}]
["4D",130,{"$f":"RANK($G141,$G$44:$G$152,1)+36","v":125},{"$f":"INDEX(BFnames,MATCH(B141,Lookups!A$2:A$145,0),2)","v":"Todd Sinnott"},null,null,{"$f":"INDEX(BFnames,MATCH(B141,Lookups!A$2:A$145,0),4)","v":862.41379310344826},{"$f":"IF(G141<>\"Scr\",1/G141,\"\")","v":1.1595361855257897E-3},{"$f":"IF(H141<>\"\",+H141/$H$153,0)","v":1.0495231284538701E-3},{"$f":"(1-I141)*I141/(1-I141/92)","v":1.0484335900404213E-3},{"$f":"IF(J141<>\"\",+J141/$J$153,0)","v":1.0944320787311019E-3},{"$f":"(1-I141-K141)*(I141+K141)/(1-(I141+K141)/92)","v":2.1394085197332102E-3},{"$f":"IF(L141<>\"\",+L141/$L$153,0)","v":1.1642730934207429E-3},{"$f":"(1-I141-K141-M141)*(I141+K141+M141)/(1-(I141+K141+M141)/92)","v":3.2974024974239654E-3},{"$f":"IF(N141<>\"\",+N141/$N$153,0)","v":1.2437937773172303E-3},{"$f":"(1-I141-K141-M141-O141)*(I141+K141+M141+O141)/(1-(I141+K141+M141+O141)/92)","v":4.5315253860076978E-3},{"$f":"IF(P141<>\"\",+P141/$P$153,0)","v":1.3284228375991304E-3},{"$f":"+I$7*I141+K$7*K141+M$7*M141+O$7*O141+Q$7*Q141","v":1.1130809364790488E-3},null,null,{"$f":"ROUND(+$R141*U$6,0)","v":31},null,null,{"$f":"ROUND(+$R141*X$6,0)","v":36},null,null,{"$f":"ROUND(+$R141*AA$6,0)","v":40},null,null,{"$f":"ROUND(+$R141*AD$6,0)","v":21}]
["4D",131,{"$f":"RANK($G142,$G$44:$G$152,1)+36","v":90},{"$f":"INDEX(BFnames,MATCH(B142,Lookups!A$2:A$145,0),2)","v":"Tim Stewart"},null,null,{"$f":"INDEX(BFnames,MATCH(B142,Lookups!A$2:A$145,0),4)","v":489},{"$f":"IF(G142<>\"Scr\",1/G142,\"\")","v":2.0449897750511249E-3},{"$f":"IF(H142<>\"\",+H142/$H$153,0)","v":1.8509677344779136E-3},{"$f":"(1-I142)*I142/(1-I142/92)","v":1.8475788247585259E-3},{"$f":"IF(J142<>\"\",+J142/$J$153,0)","v":1.92863864054764E-3},{"$f":"(1-I142-K142)*(I142+K142)/(1-(I142+K142)/92)","v":3.7654756464988821E-3},{"$f":"IF(L142<>\"\",+L142/$L$153,0)","v":2.0491841266933098E-3},{"$f":"(1-I142-K142-M142)*(I142+K142+M142)/(1-(I142+K142+M142)/92)","v":5.7951828650367994E-3},{"$f":"IF(N142<>\"\",+N142/$N$153,0)","v":2.1859668001038197E-3},{"$f":"(1-I142-K142-M142-O142)*(I142+K142+M142+O142)/(1-(I142+K142+M142+O142)/92)","v":7.9512136525164302E-3},{"$f":"IF(P142<>\"\",+P142/$P$153,0)","v":2.3309091096008435E-3},{"$f":"+I$7*I142+K$7*K142+M$7*M142+O$7*O142+Q$7*Q142","v":1.9606285323000338E-3},null,null,{"$f":"ROUND(+$R142*U$6,0)","v":55},null,null,{"$f":"ROUND(+$R142*X$6,0)","v":63},null,null,{"$f":"ROUND(+$R142*AA$6,0)","v":71},null,null,{"$f":"ROUND(+$R142*AD$6,0)","v":37}]
["4D",132,{"$f":"RANK($G143,$G$44:$G$152,1)+36","v":135},{"$f":"INDEX(BFnames,MATCH(B143,Lookups!A$2:A$145,0),2)","v":"Adam Stephens"},null,null,{"$f":"INDEX(BFnames,MATCH(B143,Lookups!A$2:A$145,0),4)","v":1100},{"$f":"IF(G143<>\"Scr\",1/G143,\"\")","v":9.0909090909090909E-4},{"$f":"IF(H143<>\"\",+H143/$H$153,0)","v":8.2283929287245428E-4},{"$f":"(1-I143)*I143/(1-I143/92)","v":8.2216958177748652E-4},{"$f":"IF(J143<>\"\",+J143/$J$153,0)","v":8.5824106839187033E-4},{"$f":"(1-I143-K143)*(I143+K143)/(1-(I143+K143)/92)","v":1.6782849967349116E-3},{"$f":"IF(L143<>\"\",+L143/$L$153,0)","v":9.133281684013503E-4},{"$f":"(1-I143-K143-M143)*(I143+K143+M143)/(1-(I143+K143+M143)/92)","v":2.5877505488522707E-3},{"$f":"IF(N143<>\"\",+N143/$N$153,0)","v":9.7611014500844078E-4},{"$f":"(1-I143-K143-M143-O143)*(I143+K143+M143+O143)/(1-(I143+K143+M143+O143)/92)","v":3.5579081534320997E-3},{"$f":"IF(P143<>\"\",+P143/$P$153,0)","v":1.0430056200707606E-3},{"$f":"+I$7*I143+K$7*K143+M$7*M143+O$7*O143+Q$7*Q143","v":8.7297564715539352E-4},null,null,{"$f":"ROUND(+$R143*U$6,0)","v":24},null,null,{"$f":"ROUND(+$R143*X$6,0)","v":28},null,null,{"$f":"ROUND(+$R143*AA$6,0)","v":31},null,null,{"$f":"ROUND(+$R143*AD$6,0)","v":17}]
["4D",133,{"$f":"RANK($G144,$G$44:$G$152,1)+36","v":135},{"$f":"INDEX(BFnames,MATCH(B144,Lookups!A$2:A$145,0),2)","v":"Anthony Summers"},null,null,{"$f":"INDEX(BFnames,MATCH(B144,Lookups!A$2:A$145,0),4)","v":1100},{"$f":"IF(G144<>\"Scr\",1/G144,\"\")","v":9.0909090909090909E-4},{"$f":"IF(H144<>\"\",+H144/$H$153,0)","v":8.2283929287245428E-4},{"$f":"(1-I144)*I144/(1-I144/92)","v":8.2216958177748652E-4},{"$f":"IF(J144<>\"\",+J144/$J$153,0)","v":8.5824106839187033E-4},{"$f":"(1-I144-K144)*(I144+K144)/(1-(I144+K144)/92)","v":1.6782849967349116E-3},{"$f":"IF(L144<>\"\",+L144/$L$153,0)","v":9.133281684013503E-4},{"$f":"(1-I144-K144-M144)*(I144+K144+M144)/(1-(I144+K144+M144)/92)","v":2.5877505488522707E-3},{"$f":"IF(N144<>\"\",+N144/$N$153,0)","v":9.7611014500844078E-4},{"$f":"(1-I144-K144-M144-O144)*(I144+K144+M144+O144)/(1-(I144+K144+M144+O144)/92)","v":3.5579081534320997E-3},{"$f":"IF(P144<>\"\",+P144/$P$153,0)","v":1.0430056200707606E-3},{"$f":"+I$7*I144+K$7*K144+M$7*M144+O$7*O144+Q$7*Q144","v":8.7297564715539352E-4},null,null,{"$f":"ROUND(+$R144*U$6,0)","v":24},null,null,{"$f":"ROUND(+$R144*X$6,0)","v":28},null,null,{"$f":"ROUND(+$R144*AA$6,0)","v":31},null,null,{"$f":"ROUND(+$R144*AD$6,0)","v":17}]
["4D",134,{"$f":"RANK($G145,$G$44:$G$152,1)+36","v":84},{"$f":"INDEX(BFnames,MATCH(B145,Lookups!A$2:A$145,0),2)","v":"Jack Thompson"},null,null,{"$f":"INDEX(BFnames,MATCH(B145,Lookups!A$2:A$145,0),4)","v":417},{"$f":"IF(G145<>\"Scr\",1/G145,\"\")","v":2.3980815347721821E-3},{"$f":"IF(H145<>\"\",+H145/$H$153,0)","v":2.1705592857546754E-3},{"$f":"(1-I145)*I145/(1-I145/92)","v":2.1658990582755361E-3},{"$f":"IF(J145<>\"\",+J145/$J$153,0)","v":2.2609247082391185E-3},{"$f":"(1-I145-K145)*(I145+K145)/(1-(I145+K145)/92)","v":4.4120584649794238E-3},{"$f":"IF(L145<>\"\",+L145/$L$153,0)","v":2.401056605129041E-3},{"$f":"(1-I145-K145-M145)*(I145+K145+M145)/(1-(I145+K145+M145)/92)","v":6.7863609890295839E-3},{"$f":"IF(N145<>\"\",+N145/$N$153,0)","v":2.5598432631071416E-3},{"$f":"(1-I145-K145-M145-O145)*(I145+K145+M145+O145)/(1-(I145+K145+M145+O145)/92)","v":9.3051169575095842E-3},{"$f":"IF(P145<>\"\",+P145/$P$153,0)","v":2.7278077071034353E-3},{"$f":"+I$7*I145+K$7*K145+M$7*M145+O$7*O145+Q$7*Q145","v":2.2980193555068736E-3},null,null,{"$f":"ROUND(+$R145*U$6,0)","v":64},null,null,{"$f":"ROUND(+$R145*X$6,0)","v":74},null,null,{"$f":"ROUND(+$R145*AA$6,0)","v":83},null,null,{"$f":"ROUND(+$R145*AD$6,0)","v":44}]
["4D",135,{"$f":"RANK($G146,$G$44:$G$152,1)+36","v":104},{"$f":"INDEX(BFnames,MATCH(B146,Lookups!A$2:A$145,0),2)","v":"Aaron Townsend"},null,null,{"$f":"INDEX(BFnames,MATCH(B146,Lookups!A$2:A$145,0),4)","v":622},{"$f":"IF(G146<>\"Scr\",1/G146,\"\")","v":1.6077170418006431E-3},{"$f":"IF(H146<>\"\",+H146/$H$153,0)","v":1.4551820291956587E-3},{"$f":"(1-I146)*I146/(1-I146/92)","v":1.4530874582266522E-3},{"$f":"IF(J146<>\"\",+J146/$J$153,0)","v":1.5168395429068385E-3},{"$f":"(1-I146-K146)*(I146+K146)/(1-(I146+K146)/92)","v":2.9632843875418463E-3},{"$f":"IF(L146<>\"\",+L146/$L$153,0)","v":1.6126290274841807E-3},{"$f":"(1-I146-K146-M146)*(I146+K146+M146)/(1-(I146+K146+M146)/92)","v":4.5638590099766757E-3},{"$f":"IF(N146<>\"\",+N146/$N$153,0)","v":1.7215063801270317E-3},{"$f":"(1-I146-K146-M146-O146)*(I146+K146+M146+O146)/(1-(I146+K146+M146+O146)/92)","v":6.2668189241206892E-3},{"$f":"IF(P146<>\"\",+P146/$P$153,0)","v":1.8371265012893814E-3},{"$f":"+I$7*I146+K$7*K146+M$7*M146+O$7*O146+Q$7*Q146","v":1.542337853178989E-3},null,null,{"$f":"ROUND(+$R146*U$6,0)","v":43},null,null,{"$f":"ROUND(+$R146*X$6,0)","v":49},null,null,{"$f":"ROUND(+$R146*AA$6,0)","v":56},null,null,{"$f":"ROUND(+$R146*AD$6,0)","v":29}]
["4D",136,{"$f":"RANK($G147,$G$44:$G$152,1)+36","v":132},{"$f":"INDEX(BFnames,MATCH(B147,Lookups!A$2:A$145,0),2)","v":"Dale Williamson"},null,null,{"$f":"INDEX(BFnames,MATCH(B147,Lookups!A$2:A$145,0),4)","v":1090},{"$f":"IF(G147<>\"Scr\",1/G147,\"\")","v":9.1743119266055051E-4},{"$f":"IF(H147<>\"\",+H147/$H$153,0)","v":8.3038827721073369E-4},{"$f":"(1-I147)*I147/(1-I147/92)","v":8.2970622141458506E-4},{"$f":"IF(J147<>\"\",+J147/$J$153,0)","v":8.6610836705821594E-4},{"$f":"(1-I147-K147)*(I147+K147)/(1-(I147+K147)/92)","v":1.6936497746131859E-3},{"$f":"IF(L147<>\"\",+L147/$L$153,0)","v":9.2168973062991047E-4},{"$f":"(1-I147-K147-M147)*(I147+K147+M147)/(1-(I147+K147+M147)/92)","v":2.6114057918210612E-3},{"$f":"IF(N147<>\"\",+N147/$N$153,0)","v":9.8503299990058512E-4},{"$f":"(1-I147-K147-M147-O147)*(I147+K147+M147+O147)/(1-(I147+K147+M147+O147)/92)","v":3.5903768035806618E-3},{"$f":"IF(P147<>\"\",+P147/$P$153,0)","v":1.0525238490751811E-3},{"$f":"+I$7*I147+K$7*K147+M$7*M147+O$7*O147+Q$7*Q147","v":8.8097430263698066E-4},null,null,{"$f":"ROUND(+$R147*U$6,0)","v":25},null,null,{"$f":"ROUND(+$R147*X$6,0)","v":28},null,null,{"$f":"ROUND(+$R147*AA$6,0)","v":32},null,null,{"$f":"ROUND(+$R147*AD$6,0)","v":17}]
["4D",137,{"$f":"RANK($G148,$G$44:$G$152,1)+36","v":92},{"$f":"INDEX(BFnames,MATCH(B148,Lookups!A$2:A$145,0),2)","v":"Aaron Wilkin"},null,null,{"$f":"INDEX(BFnames,MATCH(B148,Lookups!A$2:A$145,0),4)","v":490},{"$f":"IF(G148<>\"Scr\",1/G148,\"\")","v":2.0408163265306124E-3},{"$f":"IF(H148<>\"\",+H148/$H$153,0)","v":1.8471902493055097E-3},{"$f":"(1-I148)*I148/(1-I148/92)","v":1.8438151578946977E-3},{"$f":"IF(J148<>\"\",+J148/$J$153,0)","v":1.924709848310764E-3},{"$f":"(1-I148-K148)*(I148+K148)/(1-(I148+K148)/92)","v":3.7578269340935665E-3},{"$f":"IF(L148<>\"\",+L148/$L$153,0)","v":2.0450216724585608E-3},{"$f":"(1-I148-K148-M148)*(I148+K148+M148)/(1-(I148+K148+M148)/92)","v":5.7834508638177941E-3},{"$f":"IF(N148<>\"\",+N148/$N$153,0)","v":2.1815414410149381E-3},{"$f":"(1-I148-K148-M148-O148)*(I148+K148+M148+O148)/(1-(I148+K148+M148+O148)/92)","v":7.9351776802500627E-3},{"$f":"IF(P148<>\"\",+P148/$P$153,0)","v":2.326208142494375E-3},{"$f":"+I$7*I148+K$7*K148+M$7*M148+O$7*O148+Q$7*Q148","v":1.9566386719638619E-3},null,null,{"$f":"ROUND(+$R148*U$6,0)","v":55},null,null,{"$f":"ROUND(+$R148*X$6,0)","v":63},null,null,{"$f":"ROUND(+$R148*AA$6,0)","v":70},null,null,{"$f":"ROUND(+$R148*AD$6,0)","v":37}]
["4D",139,{"$f":"RANK($G149,$G$44:$G$152,1)+36","v":118},{"$f":"INDEX(BFnames,MATCH(B149,Lookups!A$2:A$145,0),2)","v":"Michael Wright"},null,null,{"$f":"INDEX(BFnames,MATCH(B149,Lookups!A$2:A$145,0),4)","v":808},{"$f":"IF(G149<>\"Scr\",1/G149,\"\")","v":1.2376237623762376E-3},{"$f":"IF(H149<>\"\",+H149/$H$153,0)","v":1.1202020076233907E-3},{"$f":"(1-I149)*I149/(1-I149/92)","v":1.1189607796736794E-3},{"$f":"IF(J149<>\"\",+J149/$J$153,0)","v":1.1680535455465761E-3},{"$f":"(1-I149-K149)*(I149+K149)/(1-(I149+K149)/92)","v":2.2830762251482505E-3},{"$f":"IF(L149<>\"\",+L149/$L$153,0)","v":1.2424575272328921E-3},{"$f":"(1-I149-K149-M149)*(I149+K149+M149)/(1-(I149+K149+M149)/92)","v":3.5183821716114612E-3},{"$f":"IF(N149<>\"\",+N149/$N$153,0)","v":1.3271482188458941E-3},{"$f":"(1-I149-K149-M149-O149)*(I149+K149+M149+O149)/(1-(I149+K149+M149+O149)/92)","v":4.8345177591147372E-3},{"$f":"IF(P149<>\"\",+P149/$P$153,0)","v":1.4172454643677193E-3},{"$f":"+I$7*I149+K$7*K149+M$7*M149+O$7*O149+Q$7*Q149","v":1.1879101135472369E-3},null,null,{"$f":"ROUND(+$R149*U$6,0)","v":33},null,null,{"$f":"ROUND(+$R149*X$6,0)","v":38},null,null,{"$f":"ROUND(+$R149*AA$6,0)","v":43},null,null,{"$f":"ROUND(+$R149*AD$6,0)","v":23}]
["4D",142,{"$f":"RANK($G150,$G$44:$G$152,1)+36","v":102},{"$f":"INDEX(BFnames,MATCH(B150,Lookups!A$2:A$145,0),2)","v":"Norman Xiong"},null,null,{"$f":"INDEX(BFnames,MATCH(B150,Lookups!A$2:A$145,0),4)","v":604},{"$f":"IF(G150<>\"Scr\",1/G150,\"\")","v":1.6556291390728477E-3},{"$f":"IF(H150<>\"\",+H150/$H$153,0)","v":1.4985483810591054E-3},{"$f":"(1-I150)*I150/(1-I150/92)","v":1.4963271068365945E-3},{"$f":"IF(J150<>\"\",+J150/$J$153,0)","v":1.561976267789868E-3},{"$f":"(1-I150-K150)*(I150+K150)/(1-(I150+K150)/92)","v":3.0512593426621991E-3},{"$f":"IF(L150<>\"\",+L150/$L$153,0)","v":1.6605052849622509E-3},{"$f":"(1-I150-K150-M150)*(I150+K150+M150)/(1-(I150+K150+M150)/92)","v":4.6989829410353165E-3},{"$f":"IF(N150<>\"\",+N150/$N$153,0)","v":1.7724756824031955E-3},{"$f":"(1-I150-K150-M150-O150)*(I150+K150+M150+O150)/(1-(I150+K150+M150+O150)/92)","v":6.4517953789562628E-3},{"$f":"IF(P150<>\"\",+P150/$P$153,0)","v":1.8913526009114751E-3},{"$f":"+I$7*I150+K$7*K150+M$7*M150+O$7*O150+Q$7*Q150","v":1.5881950548836048E-3},null,null,{"$f":"ROUND(+$R150*U$6,0)","v":44},null,null,{"$f":"ROUND(+$R150*X$6,0)","v":51},null,null,{"$f":"ROUND(+$R150*AA$6,0)","v":57},null,null,{"$f":"ROUND(+$R150*AD$6,0)","v":30}]
["4D",143,{"$f":"RANK($G151,$G$44:$G$152,1)+36","v":139},{"$f":"INDEX(BFnames,MATCH(B151,Lookups!A$2:A$145,0),2)","v":"Linus Yip"},null,null,{"$f":"INDEX(BFnames,MATCH(B151,Lookups!A$2:A$145,0),4)","v":1110},{"$f":"IF(G151<>\"Scr\",1/G151,\"\")","v":9.0090090090090091E-4},{"$f":"IF(H151<>\"\",+H151/$H$153,0)","v":8.154263262699998E-4},{"$f":"(1-I151)*I151/(1-I151/92)","v":8.1476862773934814E-4},{"$f":"IF(J151<>\"\",+J151/$J$153,0)","v":8.5051540833147403E-4},{"$f":"(1-I151-K151)*(I151+K151)/(1-(I151+K151)/92)","v":1.6631964900040994E-3},{"$f":"IF(L151<>\"\",+L151/$L$153,0)","v":9.0511695383220709E-4},{"$f":"(1-I151-K151-M151)*(I151+K151+M151)/(1-(I151+K151+M151)/92)","v":2.5645200144745811E-3},{"$f":"IF(N151<>\"\",+N151/$N$153,0)","v":9.673474919427937E-4},{"$f":"(1-I151-K151-M151-O151)*(I151+K151+M151+O151)/(1-(I151+K151+M151+O151)/92)","v":3.5260214761680978E-3},{"$f":"IF(P151<>\"\",+P151/$P$153,0)","v":1.033657997209936E-3},{"$f":"+I$7*I151+K$7*K151+M$7*M151+O$7*O151+Q$7*Q151","v":8.6512092967149412E-4},null,null,{"$f":"ROUND(+$R151*U$6,0)","v":24},null,null,{"$f":"ROUND(+$R151*X$6,0)","v":28},null,null,{"$f":"ROUND(+$R151*AA$6,0)","v":31},null,null,{"$f":"ROUND(+$R151*AD$6,0)","v":17}]
[]
[null,null,null,"Totals",null,null,{"$f":"H153","v":1.1048219463576643},{"$f":"SUM(H8:H152)","v":1.1048219463576643},0.99999999999999878,0.95797044916299245,1,1.8375487089952653,1.0000000000000002,2.651084574917407,1.0000000000000004,3.4112070778590056,1.0000000000000002,0.99999999999999933,null,{"$f":"SUM(T8:T152)","v":1.2907324879775628},{"$f":"SUM(U8:U152)","v":27998},null,null,{"$f":"SUM(X8:X152)","v":32003},null,null,{"$f":"SUM(AA8:AA152)","v":36001},null,null,{"$f":"SUM(AD8:AD152)","v":19076}]
[]
["SUMMARY",null,null,2012,2013,2014,2015,null,null,null,null,null,null,null,null,null,null,null,null,null,{"$f":"AK2","v":2018}]
[1,{"$f":"COUNTIF($A$8:$A$19,$A156)","v":12},{"$f":"SUM(H8:H19)+SUM(H68:H79)","v":0.67019488040882846},27350,32850,26500,28100,null,null,null,null,null,null,null,null,null,null,null,null,null,{"$f":"SUM(U8:U19)","v":15493},915,16408,17709,1047,18756,19922,1176,21098,10556,621,11177]
[2,{"$f":"COUNTIF($A$20:$A$31,$A157)","v":12},{"$f":"SUM(H20:H31)+SUM(H56:H67)","v":0.16998641435927919},6600,6150,6150,6775,null,null,null,null,null,null,null,null,null,null,null,null,null,{"$f":"+SUM(U20:U31)","v":3405},1110,4515,3894,1267,5161,4380,1427,5807,2319,754,3073]
[3,{"$f":"COUNTIF($A$32:$A$43,$A158)","v":12},{"$f":"SUM(H32:H55)","v":0.14906866204958585},5200,3750,4050,4025,null,null,null,null,null,null,null,null,null,null,null,null,null,{"$f":"SUM(U32:U43)","v":2265},1706,3971,2590,1950,4540,2913,2193,5106,1543,1164,2707]
[null,null,{"$f":"SUM(C156:C158)","v":0.98924995681769357},{"$f":"SUM(D156:D158)","v":39150},{"$f":"SUM(E156:E158)","v":42750},{"$f":"SUM(F156:F158)","v":36700},{"$f":"SUM(G156:G158)","v":38900},null,null,null,null,null,null,null,null,null,null,null,null,null,{"$f":"SUM(U156:U158)","v":21163},{"$f":"SUM(U44:U79)","v":3731},{"$f":"SUM(W156:W158)","v":24894},{"$f":"SUM(X156:X158)","v":24193},{"$f":"SUM(X44:X79)","v":4264},{"$f":"SUM(Z156:Z158)","v":28457},{"$f":"SUM(AA156:AA158)","v":27215},{"$f":"SUM(AA44:AA79)","v":4796},{"$f":"SUM(AC156:AC158)","v":32011},{"$f":"SUM(AD156:AD158)","v":14418},{"$f":"SUM(AD44:AD79)","v":2539},{"$f":"SUM(AF156:AF158)","v":16957}]
["4A",{"$f":"COUNTIF($A$8:$A$152,$A160)","v":27},{"$f":"COUNTIF($A$80:$A$152,$A160)","v":20},700,600,400,500,null,null,null,null,null,null,null,null,null,null,null,null,null,{"$f":"SUMIF($A$80:$A$152,$A160,U$80:U$152)","v":847},null,{"$f":"U160","v":847},{"$f":"SUMIF($A$80:$A$152,$A160,X$80:X$152)","v":968},null,{"$f":"X160","v":968},{"$f":"SUMIF($A$80:$A$152,$A160,AA$80:AA$152)","v":1090},null,{"$f":"AA160","v":1090},{"$f":"SUMIF($A$80:$A$152,$A160,AD$80:AD$152)","v":579},null,{"$f":"AD160","v":579},"G",525]
["4B",{"$f":"COUNTIF($A$8:$A$152,$A161)","v":24},{"$f":"COUNTIF($A$80:$A$152,$A161)","v":15},650,600,500,700,null,null,null,null,null,null,null,null,null,null,null,null,null,{"$f":"SUMIF($A$80:$A$152,$A161,U$80:U$152)","v":676},null,{"$f":"U161","v":676},{"$f":"SUMIF($A$80:$A$152,$A161,X$80:X$152)","v":770},null,{"$f":"X161","v":770},{"$f":"SUMIF($A$80:$A$152,$A161,AA$80:AA$152)","v":866},null,{"$f":"AA161","v":866},{"$f":"SUMIF($A$80:$A$152,$A161,AD$80:AD$152)","v":459},null,{"$f":"AD161","v":459}]
["4C",{"$f":"COUNTIF($A$8:$A$152,$A162)","v":27},{"$f":"COUNTIF($A$80:$A$152,$A162)","v":16},550,600,550,700,null,null,null,null,null,null,null,null,null,null,null,null,null,{"$f":"SUMIF($A$80:$A$152,$A162,U$80:U$152)","v":635},null,635,{"$f":"SUMIF($A$80:$A$152,$A162,X$80:X$152)","v":726},null,726,{"$f":"SUMIF($A$80:$A$152,$A162,AA$80:AA$152)","v":816},null,816,{"$f":"SUMIF($A$80:$A$152,$A162,AD$80:AD$152)","v":435},null,435,"M",475]
["4D",{"$f":"COUNTIF($A$8:$A$152,$A163)","v":30},{"$f":"COUNTIF($A$80:$A$152,$A163)","v":21},650,600,400,800,null,null,null,null,null,null,null,null,null,null,null,null,null,{"$f":"SUMIF($A$80:$A$152,$A163,U$80:U$152)","v":946},null,946,{"$f":"SUMIF($A$80:$A$152,$A163,X$80:X$152)","v":1082},null,1082,{"$f":"SUMIF($A$80:$A$152,$A163,AA$80:AA$152)","v":1218},null,1218,{"$f":"SUMIF($A$80:$A$152,$A163,AD$80:AD$152)","v":646},null,646,"G",525]
[4,{"$f":"SUM(B156:B163)","v":144},{"$f":"SUM(H80:H151)","v":0.11557198953996993},{"$f":"SUM(D160:D163)","v":2550},{"$f":"SUM(E160:E163)","v":2400},{"$f":"SUM(F160:F163)","v":1850},{"$f":"SUM(G160:G163)","v":2700},null,null,null,null,null,null,null,null,null,null,null,null,null,{"$f":"SUM(U160:U163)","v":3104},null,3104,{"$f":"SUM(X160:X163)","v":3546},null,3546,{"$f":"SUM(AA160:AA163)","v":3990},null,3990,{"$f":"SUM(AD160:AD163)","v":2119},null,2119]
[null,null,null,{"$f":"D159+D164","v":41700},{"$f":"E159+E164","v":45150},{"$f":"F159+F164","v":38550},{"$f":"G159+G164","v":41600},null,null,null,null,null,null,null,null,null,null,null,null,null,{"$f":"SUM(U156:U158)+U164","v":24267},{"$f":"SUM(V156:V158)+V164","v":3731},27998,27739,4264,32003,31205,4796,36001,16537,2539,19076]
["Bidders:",null,null,7,10,10,13,null,null,null,null,null,null,null,null,null,null,null,null,null,null,null,null,null,null,null,null,null,null,null,null,null,12]

{"sheet":"Lookups","index":1,"n_rows":145,"n_cols":9,"rows_kept":145,"cut":false,"hidden":false,"merged":[]}
[]
[{"$f":"VLOOKUP(C2,BillsNames,3)","v":1},{"$f":"INDEX(BFX,ROW()-1,1)","v":"Cameron Smith"},{"$f":"RIGHT(B2,LEN(B2)-FIND(\" \",B2,2))&\" \"&LEFT(B2,IF(RIGHT(B2,5)=\"Brown\",2,1))","v":"Smith C"},{"$f":"INDEX(BFX,ROW()-1,14)","v":8.2017806556050168},null,null,{"$f":"RIGHT(H2,LEN(H2)-FIND(\" \",H2,2))&\" \"&LEFT(H2,1)","v":"Allan S"},"S. Allan",41]
[2,"Keegan Bradley","Bradley K",11.120135363790187,null,null,"Allenby R","R. Allenby",40]
[3,"Matt Kuchar","Kuchar M",11.620949074074074,null,null,"An S","S. An",39]
[4,"Brandt Snedeker","Snedeker B",12.100284495021338,null,null,"Ancer A","A. Ancer",6]
[5,"Byeong Hun An","Hun An B",16.148387096774194,null,null,"Anstiss J","J. Anstiss",38]
[6,"Abraham Ancer","Ancer A",16.826039387308533,null,null,"Antcliff M","M. Antcliff",43]
[7,"Cameron Davis","Davis C",21.682017543859651,null,null,"Armstrong D","D. Armstrong",42]
[8,"Anirban Lahiri","Lahiri A",33.354838709677416,null,null,"Arnold J","J. Arnold",37]
[9,"Brendan Steele","Steele B",38.143344709897612,null,null,"Basic N","N. Basic",53]
[11,"Dimitrios Papadatos","Papadatos D",592,null,null,"Bateman H","H. Bateman",47]
[10,"Nicolas Colsaerts","Colsaerts N",68.811881188118818,null,null,"Bauchou Z","Z. Bauchou",48]
[17,"Rhein Gibson","Gibson R",251.06060606060606,null,null,"Beck D","D. Beck",51]
[22,"Cameron John","John C",73.07692307692308,null,null,"Becker B","B. Becker",44]
[18,"Anthony Quayle","Quayle A",159.42528735632186,null,null,"Bland A","A. Bland",30]
[12,"Marcus Fraser","Fraser M",64.078947368421055,null,null,"Blyth A","A. Blyth",46]
[21,"Brett Coletta","Coletta B",114.47368421052632,null,null,"Bourke R","R. Bourke",54]
[13,"Rod Pampling","Pampling R",89.2,null,null,"Bradley K","K. Bradley",2]
[19,"Cameron Percy","Percy C",65.9375,null,null,"Brandt Richards D","D. Brandt Richards",50]
[14,"John Senden","Senden J",68.07692307692308,null,null,{"$f":"RIGHT(H20,LEN(H20)-FIND(\" \",H20,2))&\" \"&LEFT(H20,2)","v":"Brown Ma"},"Mark Brown",45]
[29,"Harrison Endycott","Endycott H",71.25,null,null,{"$f":"RIGHT(H21,LEN(H21)-FIND(\" \",H21,2))&\" \"&LEFT(H21,2)","v":"Brown Mi"},"Mitchell Brown",52]
[16,"Nick Voke","Voke N",83,null,null,{"$f":"RIGHT(H22,LEN(H22)-FIND(\" \",H22,2))&\" \"&LEFT(H22,1)","v":"Burdett A"},"A. Burdett",49]
[15,"Matthew Griffin","Griffin M",85.597826086956516,null,null,"Campbell B","B. Campbell",57]
[26,"Matthew Millar","Millar M",84.954545454545453,null,null,"Chalmers G","G. Chalmers",23]
[126,"Michael Sim","Sim M",872.58064516129036,null,null,"Chisnall R","R. Chisnall",58]
[30,"Adam Bland","Bland A",195.0632911392405,null,null,"Choat A","A. Choat",59]
[23,"Greg Chalmers","Chalmers G",98.835616438356169,null,null,"Clementson B","B. Clementson",60]
[36,"Andrew Dodt","Dodt A",117.90322580645162,null,null,"Coletta B","B. Coletta",21]
[31,"Ben Eccles","Eccles B",810.90909090909088,null,null,"Colsaerts N","N. Colsaerts",10]
[34,"Jarryd Felton","Felton J",153.33333333333334,null,null,"Cooke P","P. Cooke",55]
[76,"Jake Higginbottom","Higginbottom J",203.47826086956522,null,null,"Crawford C","C. Crawford",56]
[35,"Mikko Ilonen","Ilonen M",118.07692307692308,null,null,"Cullen N","N. Cullen",27]
[24,"Jake McLeod","McLeod J",85.434782608695656,null,null,"Dann C","C. Dann",63]
[{"$f":"VLOOKUP(C34,BillsNames,3)","v":106},{"$f":"INDEX(BFX,ROW()-1,1)","v":"Daniel Nisbet"},"Nisbet D",{"$f":"INDEX(BFX,ROW()-1,14)","v":864.19354838709683},null,null,"Davis C","C. Davis",7]
[28,"Travis Smyth","Smyth T",532.38095238095241,null,null,"Davis M","M. Davis",61]
[20,"Zach Murray","Murray Z",107.5609756097561,null,null,"Dive M","M. Dive",62]
[25,"Jordan Zunic","Zunic J",132.5,null,null,"Dodt A","A. Dodt",36]
[103,"David Micheluzzi","Micheluzzi D",130,null,null,"Eccles B","B. Eccles",31]
[142,"Norman Xiong","Xiong N",604,null,null,"Edge A","A. Edge",65]
[33,"Douglas Klein","Klein D",446.05263157894734,null,null,"Endycott H","H. Endycott",29]
[77,"Viktor Hovland","Hovland V",514.40476190476193,null,null,"Evans A","A. Evans",64]
[83,"Damien Jordan","Jordan D",819.39393939393938,null,null,"Fairfax G","G. Fairfax",70]
[87,"Takumi Kanaya","Kanaya T",258,null,null,"Felton J","J. Felton",34]
[104,"James Marchesani","Marchesani J",858.9655172413793,null,null,"Fewkes C","C. Fewkes",66]
[27,"Nick Cullen","Cullen N",91.25,null,null,"Flanagan N","N. Flanagan",67]
[79,"Simon Hawkes","Hawkes S",531.25,null,null,"Fowler P","P. Fowler",69]
[107,"Jason Norris","Norris J",243.4375,null,null,"Fox D","D. Fox",68]
[46,"Adam Blyth","Blyth A",309,null,null,"Fraser M","M. Fraser",12]
[102,"David McKenzie","McKenzie D",271.83333333333337,null,null,"Gale D","D. Gale",74]
[57,"Ben Campbell","Campbell B",407.5,null,null,"Gibson R","R. Gibson",17]
[45,"Mark Brown","Brown Ma",239.51219512195121,null,null,"Giles M","M. Giles",73]
[32,"Deyen Lawson","Lawson D",143.89830508474577,null,null,"Gleeson D","D. Gleeson",72]
[117,"Daniel Pearce","Pearce D",491,null,null,"Goggin M","M. Goggin",75]
[141,"Jack Wilson","Wilson J",305.29411764705884,null,null,{"$f":"RIGHT(H54,LEN(H54)-FIND(\" \",H54,2))&\" \"&LEFT(H54,1)","v":"Griffin M"},"M. Griffin",15]
[84,"Steven Jeffress","Jeffress S",716.21621621621625,null,null,"Guyatt M","M. Guyatt",71]
[108,"James Nitties","Nitties J",734,null,null,"Hall A","A. Hall",78]
[138,"Peter Wilson","Wilson P",307,null,null,"Hart T","T. Hart",81]
[75,"Mathew Goggin","Goggin M",485,null,null,"Hawkes S","S. Hawkes",79]
[125,"Robby Shelton","Shelton R",409.47368421052636,null,null,"Hensby M","M. Hensby",82]
[42,"Dawson Armstrong","Armstrong D",327,null,null,"Higginbottom J","J. Higginbottom",76]
[119,"Dylan Perry","Perry D",177,null,null,"Hillier D","D. Hillier",80]
[134,"Jack Thompson","Thompson J",417,null,null,"Hovland V","V. Hovland",77]
[127,"Peter Senior","Senior P",622.17391304347825,null,null,"Hun An B","B. Hun An",5]
[115,"Craig Parry","Parry C",415,null,null,"Ilonen M","M. Ilonen",35]
[40,"Robert Allenby","Allenby R",794.28571428571433,null,null,"Jager M","M. Jager",85]
[{"$f":"VLOOKUP(C66,BillsNames,3)","v":88},{"$f":"INDEX(BFX,ROW()-1,1)","v":"Peter Lonard"},{"$f":"RIGHT(B66,LEN(B66)-FIND(\" \",B66,2))&\" \"&LEFT(B66,IF(RIGHT(B66,5)=\"Brown\",2,1))","v":"Lonard P"},{"$f":"INDEX(BFX,ROW()-1,14)","v":400},null,null,"Jeffress S","S. Jeffress",84]
[41,"Stephen Allan","Allan S",400,null,null,"John C","C. John",22]
[69,"Peter Fowler","Fowler P",269,null,null,"Jordan D","D. Jordan",83]
[48,"Zach Bauchou","Bauchou Z",297,null,null,"Kanaya T","T. Kanaya",87]
[72,"David Gleeson","Gleeson D",485,null,null,"Klein D","D. Klein",33]
[140,"Shae Wools Cobb","Wools Cobb S",318,null,null,"Kuchar M","M. Kuchar",3]
[123,"Terry Pilkadaris","Pilkadaris T",308.57142857142856,null,null,"Kulacz R","R. Kulacz",86]
[130,"Todd Sinnott","Sinnott T",862.41379310344826,null,null,"Lahiri A","A. Lahiri",8]
[109,"Keita Nakajima","Nakajima K",349,null,null,"Lawson D","D. Lawson",32]
[66,"Connor Fewkes","Fewkes C",429,null,null,"Lee S","S. Lee",91]
[80,"Daniel Hillier","Hillier D",280,null,null,"Lisk M","M. Lisk",90]
[70,"Gavin Fairfax","Fairfax G",955,null,null,"Lonard P","P. Lonard",88]
[121,"Aaron Pike","Pike A",167,null,null,"Lynch R","R. Lynch",89]
[74,"Daniel Gale","Gale D",336.36363636363637,null,null,"Macdonald T","T. Macdonald",96]
[68,"Daniel Fox","Fox D",852.17391304347825,null,null,"Marchesani A","A. Marchesani",94]
[56,"Cory Crawford","Crawford C",490,null,null,"Marchesani J","J. Marchesani",104]
[135,"Aaron Townsend","Townsend A",622,null,null,"Martin A","A. Martin",105]
[110,"Peter OMalley","OMalley P",906,null,null,"McCardle M","M. McCardle",101]
[111,"Nick OHern","OHern N",397,null,null,"McKenzie D","D. McKenzie",102]
[122,"Aron Price","Price A",184,null,null,"McLeod J","J. McLeod",24]
[96,"Taylor Macdonald","Macdonald T",387,null,null,{"$f":"RIGHT(H86,LEN(H86)-FIND(\" \",H86,2))&\" \"&LEFT(H86,1)","v":"Micheluzzi D"},"D. Micheluzzi",103]
[71,"Matthew Guyatt","Guyatt M",721.42857142857144,null,null,"Millar M","M. Millar",26]
[37,"Jamie Arnold","Arnold J",208.57142857142856,null,null,"Morgan J","J. Morgan",92]
[51,"Darren Beck","Beck D",405,null,null,"Moses T","T. Moses",95]
[50,"Dale Brandt Richards","Brandt Richards D",726.55172413793105,null,null,"Moules B","B. Moules",93]
[{"$f":"VLOOKUP(C91,BillsNames,3)","v":112},"Callan OReilly","OReilly C",259,null,null,"Muir K","K. Muir",97]
[144,"Josh Younger","Younger J",323.24324324324323,null,null,"Mullaney J","J. Mullaney",98]
[116,"Gareth Paddison","Paddison G",706.20689655172418,null,null,"Munro J","J. Munro",99]
[113,"Brett Rankin","Rankin B",407,null,null,"Murdaca A","A. Murdaca",100]
[129,"Scott Strange","Strange S",407,null,null,"Murray Z","Z. Murray",20]
[128,"Matthew Stieger","Stieger M",850,null,null,"Nakajima K","K. Nakajima",109]
[78,"Ashley Hall","Hall A",849.61538461538464,null,null,"Nisbet D","D. Nisbet",106]
[49,{"$f":"INDEX(BFX,ROW()-1,1)","v":"Adam Burdett"},"Burdett A",{"$f":"INDEX(BFX,ROW()-1,14)","v":462},null,null,"Nitties J","J. Nitties",108]
[58,"Ryan Chisnall","Chisnall R",255,null,null,"Norris J","J. Norris",107]
[44,"Braden Becker","Becker B",706,null,null,"OHern N","N. OHern",111]
[67,"Nick Flanagan","Flanagan N",414,null,null,"OMalley P","P. OMalley",110]
[131,"Tim Stewart","Stewart T",489,null,null,"OReilly C","C. OReilly",112]
[105,"Andrew Martin","Martin A",847.82608695652175,null,null,"Paddison G","G. Paddison",116]
[139,"Michael Wright","Wright M",808,null,null,"Pampling R","R. Pampling",13]
[85,"Matt Jager","Jager M",489,null,null,"Papadatos D","D. Papadatos",11]
[99,"Jack Munro","Munro J",387,null,null,"Parry C","C. Parry",115]
[97,"Kieran Muir","Muir K",491,null,null,"Pearce D","D. Pearce",117]
[47,"Harry Bateman","Bateman H",725.16129032258073,null,null,"Percy C","C. Percy",19]
[98,"Jordan Mullaney","Mullaney J",277,null,null,"Perry D","D. Perry",119]
[91,"Sam Lee","Lee S",1100,null,null,"Perry M","M. Perry",118]
[132,"Adam Stephens","Stephens A",1100,null,null,"Pike A","A. Pike",121]
[101,"Max McCardle","McCardle M",579.61538461538464,null,null,"Pilkadaris T","T. Pilkadaris",123]
[54,"Rory Bourke","Bourke R",906,null,null,"Price A","A. Price",122]
[81,"Tim Hart","Hart T",305,null,null,"Proverbs B","B. Proverbs",120]
[73,"Matthew Giles","Giles M",490,null,null,"Quayle A","A. Quayle",18]
[60,"Benjamin Clementson","Clementson B",706,null,null,"Rankin B","B. Rankin",113]
[93,"Brad Moules","Moules B",706,null,null,"Rawson C","C. Rawson",114]
[100,"Antonio Murdaca","Murdaca A",371,null,null,{"$f":"RIGHT(H118,LEN(H118)-FIND(\" \",H118,2))&\" \"&LEFT(H118,1)","v":"Senden J"},"J. Senden",14]
[43,"Maverick Antcliff","Antcliff M",804.65116279069775,null,null,"Senior P","P. Senior",127]
[53,"Neven Basic","Basic N",490,null,null,"Shelton R","R. Shelton",125]
[86,"Rick Kulacz","Kulacz R",303,null,null,"Sim M","M. Sim",126]
[137,"Aaron Wilkin","Wilkin A",490,null,null,"Sinnott T","T. Sinnott",130]
[124,"Ruben Sondjaja","Sondjaja R",416,null,null,"Smith C","C. Smith",1]
[94,"Anthony Marchesani","Marchesani A",1100,null,null,"Smyth T","T. Smyth",28]
[133,"Anthony Summers","Summers A",1100,null,null,"Snedeker B","B. Snedeker",4]
[118,"Mathew Perry","Perry M",419,null,null,"Sondjaja R","R. Sondjaja",124]
[38,"James Anstiss","Anstiss J",1090,null,null,"Steele B","B. Steele",9]
[95,"Troy Moses","Moses T",355,null,null,"Stephens A","A. Stephens",132]
[65,"Alex Edge","Edge A",1090,null,null,"Stewart T","T. Stewart",131]
[52,{"$f":"INDEX(BFX,ROW()-1,1)","v":"Mitchell Brown"},{"$f":"RIGHT(B130,LEN(B130)-FIND(\" \",B130,2))&\" \"&LEFT(B130,IF(RIGHT(B130,5)=\"Brown\",2,1))","v":"Brown Mi"},{"$f":"INDEX(BFX,ROW()-1,14)","v":905},null,null,"Stieger M","M. Stieger",128]
[55,"Peter Cooke",{"$f":"RIGHT(B131,LEN(B131)-FIND(\" \",B131,2))&\" \"&LEFT(B131,IF(RIGHT(B131,5)=\"Brown\",2,1))","v":"Cooke P"},491,null,null,"Strange S","S. Strange",129]
[136,"Dale Williamson","Williamson D",1090,null,null,"Summers A","A. Summers",133]
[89,"Ryan Lynch","Lynch R",708,null,null,"Thompson J","J. Thompson",134]
[120,"Blake Proverbs","Proverbs B",237.55555555555554,null,null,"Townsend A","A. Townsend",135]
[82,"Mark Hensby","Hensby M",348,null,null,"Voke N","N. Voke",16]
[92,"Jediah Morgan","Morgan J",1110,null,null,"Wilkin A","A. Wilkin",137]
[143,"Linus Yip","Yip L",1110,null,null,"Williamson D","D. Williamson",136]
[64,{"$f":"INDEX(BFX,ROW()-1,1)","v":"Andrew Evans"},"Evans A",367,null,null,"Wilson J","J. Wilson",141]
[39,"Sam An","An S",1110,null,null,"Wilson P","P. Wilson",138]
[90,"Matthew Lisk","Lisk M",1110,null,null,"Wools Cobb S","S. Wools Cobb",140]
[59,"Anthony Choat","Choat A",1110,null,null,"Wright M","M. Wright",139]
[63,"Charlie Dann","Dann C",366,null,null,"Xiong N","N. Xiong",142]
[62,"Martin Dive","Dive M",1110,null,null,"Yip L","L. Yip",143]
[61,"Mitch Davis","Davis M",618,null,null,"Younger J","J. Younger",144]
[114,"Campbell Rawson","Rawson C",110,null,null,"Zunic J","J. Zunic",25]

{"sheet":"Betfair","index":2,"n_rows":169,"n_cols":16,"rows_kept":169,"cut":false,"hidden":false,"merged":[]}
[null,"144 selections",1.2889999999999999,"Back all","Lay all",0.86499999999999999]
[]
[null,"Cameron Smith","7.8$225","8$1075","8.2$22","8.4$2449","8.8$171","9$732",{"$f":"FIND(\"$\",E3)","v":4},{"$f":"IF(ISBLANK(F3),0,FIND(\"$\",F3))","v":4},{"$f":"VALUE(LEFT(E3,I3-1))","v":8.1999999999999993},{"$f":"VALUE(RIGHT(E3,LEN(E3)-I3))","v":22},{"$f":"IF(J3,VALUE(LEFT(F3,J3-1)),0)","v":8.4},{"$f":"IF(J3,VALUE(RIGHT(F3,LEN(F3)-J3)),0)","v":2449},{"$f":"IF(M3,K3+(M3-K3)*L3/(L3+N3),K3+IF(K3=1000,L3*10,L3))","v":8.2017806556050168}]
[null,"Keegan Bradley","10$850","10.5$17","11$142","11.5$449","12.5$27","13$43",3,5,11,142,11.5,449,{"$f":"IF(M4,K4+(M4-K4)*L4/(L4+N4),K4+IF(K4=1000,L4*10,L4))","v":11.120135363790187}]
[null,"Matt Kuchar","10.5$629","11$35","11.5$209","12$655","13$40","13.5$10",5,3,11.5,209,12,655,11.620949074074074]
[null,"Brandt Snedeker","11$844","11.5$108","12$141","12.5$562","13$44","14$11",3,5,12,141,12.5,562,12.100284495021338]
[null,"Byeong Hun An","14.5$325","15.5$15","16$138","16.5$327","17$65","18$10",3,5,16,138,16.5,327,16.148387096774194]
[null,"Abraham Ancer","15$125","16$365","16.5$149","17.5$308","18.5$51","19$7",5,5,16.5,149,17.5,308,16.826039387308533]
[null,"Cameron Davis","19.5$413","20$25","21$311","22$145","23$578","25$10",3,3,21,311,22,145,21.682017543859651]
[null,"Anirban Lahiri","28$51","29$23","30$26","34$5","36$149","40$97",3,3,30,26,34,5,33.354838709677416]
[null,"Brendan Steele","34$12","36$6","38$21","40$272","42$78","46$10",3,3,38,21,40,272,38.143344709897612]
[null,"Dimitrios Papadatos","65$24","70$16","200$28","690$7","700$10",null,4,4,200,28,690,7,592]
[null,"Nicolas Colsaerts","50$8","55$7","60$89","70$12","80$12","85$7",3,3,60,89,70,12,68.811881188118818]
[null,"Rhein Gibson","48$72","50$33","110$49","300$17",null,null,4,4,110,49,300,17,251.06060606060606]
[null,"Cameron John","50$82","55$8","65$21","75$5","85$5","90$7",3,3,65,21,75,5,73.07692307692308]
[null,"Anthony Quayle","70$18","80$6","95$59","190$28",null,null,3,4,95,59,190,28,159.42528735632186]
[null,"Marcus Fraser","44$11","48$30","50$107","65$7","80$11","90$10",3,3,50,107,65,7,64.078947368421055]
[null,"Brett Coletta","65$85","75$17","90$62","120$14",null,null,3,4,90,62,120,14,114.47368421052632]
[null,"Rod Pampling","50$74","70$10","85$63","90$12","100$15",null,3,3,85,63,90,12,89.2]
[null,"Cameron Percy","50$8","55$62","60$114","70$78","75$9","80$27",3,3,60,114,70,78,65.9375]
[null,"John Senden","48$47","50$98","55$34","70$5","75$15","85$10",3,3,55,34,70,5,68.07692307692308]
[null,"Harrison Endycott","60$30","65$92","70$5","80$35","90$13","95$101",3,3,70,5,80,35,71.25]
[null,"Nick Voke","55$200","65$10","70$13",null,null,null,3,0,70,13,0,0,83]
[null,"Matthew Griffin","60$153","65$85","75$39","100$53","110$19",null,3,4,75,39,100,53,85.597826086956516]
[null,"Matthew Millar","60$196","65$45","75$73","90$37",null,null,3,3,75,73,90,37,84.954545454545453]
[null,"Michael Sim","100$34","130$17","210$26","1000$5",null,null,4,5,210,26,1000,5,872.58064516129036]
[null,"Adam Bland","90$56","95$12","110$56","230$23","380$5",null,4,4,110,56,230,23,195.0632911392405]
[null,"Greg Chalmers","85$55","90$61","95$56","100$17","110$6","120$32",3,4,95,56,100,17,98.835616438356169]
[null,"Andrew Dodt","80$60","100$20","110$49","120$13","1000$7",null,4,4,110,49,120,13,117.90322580645162]
[null,"Ben Eccles","90$38","130$8","200$28","920$5",null,null,4,4,200,28,920,5,810.90909090909088]
[null,"Jarryd Felton","100$13","110$20","120$10","230$23","1000$7",null,4,4,120,10,230,23,153.33333333333334]
[null,"Jake Higginbottom","110$45","120$28","130$26","260$20","270$33","1000$7",4,4,130,26,260,20,203.47826086956522,"xxx"]
[null,"Mikko Ilonen","80$25","100$20","110$14","140$38","150$18","1000$7",4,4,110,14,140,38,118.07692307692308]
[null,"Jake McLeod","70$157","75$6","80$5","130$41","1000$7",null,3,4,80,5,130,41,85.434782608695656,"xxx"]
[null,"Daniel Nisbet","120$28","140$11","210$26","990$5","1000$7",null,4,4,210,26,990,5,864.19354838709683]
[null,"Travis Smyth","95$19","100$11","160$34","620$8","1000$7",null,4,4,160,34,620,8,532.38095238095241]
[null,"Zach Murray","70$108","75$87","90$36","110$5","150$9",null,3,4,90,36,110,5,107.5609756097561]
[null,"Jordan Zunic","75$64","100$20","110$51","140$17","150$8",null,4,4,110,51,140,17,132.5]
[null,"David Micheluzzi","90$84","100$52","110$20",null,null,null,4,0,110,20,0,0,130]
[null,"Norman Xiong","80$25","90$122","100$14","1000$11",null,null,4,5,100,14,1000,11,604]
[null,"Douglas Klein","75$21","80$21","90$66","500$10",null,null,3,4,90,66,500,10,446.05263157894734]
[null,"Viktor Hovland","75$21","90$38","110$79","540$5",null,null,4,4,110,79,540,5,514.40476190476193]
[null,"Damien Jordan","130$12","150$14","200$28","930$5","1000$7",null,4,4,200,28,930,5,819.39393939393938]
[null,"Takumi Kanaya","130$26","140$15","160$14","300$6",null,null,4,4,160,14,300,6,258]
[null,"James Marchesani","160$10","220$10","230$24","990$5","1000$7",null,4,4,230,24,990,5,858.9655172413793]
[null,"Nick Cullen","70$52","75$25","80$30","110$50","120$12","1000$7",3,4,80,30,110,50,91.25]
[null,"Simon Hawkes","210$35","220$15","250$6","1000$10",null,null,4,5,250,6,1000,10,531.25]
[null,"Jason Norris","200$9","210$5","220$25","250$7","260$5","1000$7",4,4,220,25,250,7,243.4375,"xxx"]
[null,"Adam Blyth","240$18","280$7","290$19",null,null,null,4,0,290,19,0,0,309]
[null,"David McKenzie","95$16","120$42","130$23","500$37",null,null,4,4,130,23,500,37,271.83333333333337]
[null,"Ben Campbell","140$10","180$12","190$29","490$11",null,null,4,4,190,29,490,11,407.5]
[null,"Mark Brown","100$17","110$99","140$24","310$17","580$5",null,4,4,140,24,310,17,239.51219512195121]
[null,"Deyen Lawson","85$40","100$20","110$50","150$9",null,null,4,4,110,50,150,9,143.89830508474577]
[null,"Daniel Pearce","300$11","400$18","480$11",null,null,null,4,0,480,11,0,0,491]
[null,"Jack Wilson","250$5","260$8","270$20","330$14","700$12",null,4,4,270,20,330,14,305.29411764705884]
[null,"Steven Jeffress","140$5","150$7","180$31","820$6","1000$7",null,4,4,180,31,820,6,716.21621621621625]
[null,"James Nitties","200$8","210$35","240$13","1000$7",null,null,4,5,240,13,1000,7,734]
[null,"Peter Wilson","280$12","290$13","300$7",null,null,null,4,0,300,7,0,0,307]
[null,"Mathew Goggin","330$33","340$5","480$5",null,null,null,4,0,480,5,0,0,485]
[null,"Robby Shelton","160$21","200$7","220$10","580$9","1000$10",null,4,4,220,10,580,9,409.47368421052636]
[null,"Dawson Armstrong","300$16","310$24","320$7",null,null,null,4,0,320,7,0,0,327]
[null,"Dylan Perry","130$58","140$10","170$7",null,null,null,4,0,170,7,0,0,177]
[null,"Jack Thompson","230$14","240$9","410$7",null,null,null,4,0,410,7,0,0,417]
[null,"Peter Senior","190$17","200$9","210$12","1000$11",null,null,4,5,210,12,1000,11,622.17391304347825]
[null,"Craig Parry","330$10","400$18","410$5",null,null,null,4,0,410,5,0,0,415]
[null,"Robert Allenby","240$11","270$8","280$20","1000$8",null,null,4,5,280,20,1000,8,794.28571428571433]
[null,"Peter Lonard","300$16","380$5","390$10",null,null,null,{"$f":"FIND(\"$\",E67)","v":4},{"$f":"IF(ISBLANK(F67),0,FIND(\"$\",F67))","v":0},{"$f":"VALUE(LEFT(E67,I67-1))","v":390},{"$f":"VALUE(RIGHT(E67,LEN(E67)-I67))","v":10},{"$f":"IF(J67,VALUE(LEFT(F67,J67-1)),0)","v":0},{"$f":"IF(J67,VALUE(RIGHT(F67,LEN(F67)-J67)),0)","v":0},400]
[null,"Stephen Allan","300$36","380$5","390$10",null,null,null,4,0,390,10,0,0,{"$f":"IF(M68,K68+(M68-K68)*L68/(L68+N68),K68+IF(K68=1000,L68*10,L68))","v":400}]
[null,"Peter Fowler","240$9","250$5","260$9",null,null,null,4,0,260,9,0,0,269]
[null,"Zach Bauchou","230$32","240$14","280$17",null,null,null,4,0,280,17,0,0,297]
[null,"David Gleeson","260$6","330$33","480$5",null,null,null,4,0,480,5,0,0,485]
[null,"Shae Wools Cobb","240$14","290$11","310$8",null,null,null,4,0,310,8,0,0,318]
[null,"Terry Pilkadaris","140$12","150$5","210$9","440$12","1000$10",null,4,4,210,9,440,12,308.57142857142856]
[null,"Todd Sinnott","210$35","240$23","250$24","990$5",null,null,4,4,250,24,990,5,862.41379310344826]
[null,"Keita Nakajima","300$16","330$22","340$9",null,null,null,4,0,340,9,0,0,349]
[null,"Connor Fewkes","330$10","400$18","420$9",null,null,null,4,0,420,9,0,0,429]
[null,"Daniel Hillier","210$35","250$24","270$10",null,null,null,4,0,270,10,0,0,280]
[null,"Gavin Fairfax","270$5","350$9","950$5",null,null,null,4,0,950,5,0,0,955]
[null,"Aaron Pike","140$37","150$6","160$7",null,null,null,4,0,160,7,0,0,167]
[null,"Daniel Gale","230$14","240$13","270$10","1000$100",null,null,4,5,270,10,1000,100,336.36363636363637]
[null,"Daniel Fox","240$14","310$7","320$18","1000$5",null,null,4,5,320,18,1000,5,852.17391304347825]
[null,"Cory Crawford","330$10","400$18","480$10",null,null,null,4,0,480,10,0,0,490]
[null,"Aaron Townsend","350$9","600$12","610$12",null,null,null,4,0,610,12,0,0,622]
[null,"Peter OMalley","350$9","600$12","900$6",null,null,null,4,0,900,6,0,0,906]
[null,"Nick OHern","320$10","380$5","390$7",null,null,null,4,0,390,7,0,0,397]
[null,"Aron Price","140$12","150$30","170$14",null,null,null,4,0,170,14,0,0,184]
[null,"Taylor Macdonald","320$10","330$22","380$7",null,null,null,4,0,380,7,0,0,387]
[null,"Matthew Guyatt","250$6","300$36","350$12","1000$9",null,null,4,5,350,12,1000,9,721.42857142857144]
[null,"Jamie Arnold","130$5","150$16","160$34","240$22","250$5",null,4,4,160,34,240,22,208.57142857142856]
[null,"Darren Beck","300$36","380$5","390$15",null,null,null,4,0,390,15,0,0,405]
[null,"Dale Brandt Richards","300$36","380$5","390$16","1000$13",null,null,4,5,390,16,1000,13,726.55172413793105]
[null,"Callan OReilly","210$16","230$25","250$9",null,null,null,4,0,250,9,0,0,259]
[null,"Josh Younger","160$31","170$5","200$24","390$13","400$10",null,{"$f":"FIND(\"$\",E93)","v":4},{"$f":"IF(ISBLANK(F93),0,FIND(\"$\",F93))","v":4},{"$f":"VALUE(LEFT(E93,I93-1))","v":200},{"$f":"VALUE(RIGHT(E93,LEN(E93)-I93))","v":24},{"$f":"IF(J93,VALUE(LEFT(F93,J93-1)),0)","v":390},{"$f":"IF(J93,VALUE(RIGHT(F93,LEN(F93)-J93)),0)","v":13},323.24324324324323]
[null,"Gareth Paddison","240$14","250$7","270$23","820$6",null,null,{"$f":"FIND(\"$\",E94)","v":4},{"$f":"IF(ISBLANK(F94),0,FIND(\"$\",F94))","v":4},{"$f":"VALUE(LEFT(E94,I94-1))","v":270},{"$f":"VALUE(RIGHT(E94,LEN(E94)-I94))","v":23},{"$f":"IF(J94,VALUE(LEFT(F94,J94-1)),0)","v":820},{"$f":"IF(J94,VALUE(RIGHT(F94,LEN(F94)-J94)),0)","v":6},706.20689655172418]
[null,"Brett Rankin","300$36","380$5","400$7",null,null,null,4,0,400,7,0,0,407]
[null,"Scott Strange","290$7","300$36","400$7",null,null,null,4,0,400,7,0,0,407]
[null,"Matthew Stieger","260$5","300$7","310$18","1000$5",null,null,4,5,310,18,1000,5,850]
[null,"Ashley Hall","240$9","250$7","260$21","990$5","1000$10",null,4,4,260,21,990,5,849.61538461538464]
[null,"Adam Burdett","300$11","330$22","450$12",null,null,null,4,0,450,12,0,0,462]
[null,"Ryan Chisnall","200$9","210$51","250$5",null,null,null,4,0,250,5,0,0,255]
[null,"Braden Becker","350$9","400$18","700$6",null,null,null,4,0,700,6,0,0,706]
[null,"Nick Flanagan","280$7","290$5","300$19","450$6",null,null,4,4,300,19,450,6,414]
[null,"Tim Stewart","320$10","330$22","480$9",null,null,null,4,0,480,9,0,0,489]
[null,"Andrew Martin","280$7","290$6","300$18","1000$5",null,null,4,5,300,18,1000,5,847.82608695652175]
[null,"Michael Wright","220$19","270$7","280$20","940$5",null,null,4,4,280,20,940,5,808]
[null,"Matt Jager","350$9","400$18","480$9",null,null,null,4,0,480,9,0,0,489]
[null,"Jack Munro","320$10","330$22","380$7",null,null,null,4,0,380,7,0,0,387]
[null,"Kieran Muir","310$10","400$18","480$11",null,null,null,4,0,480,11,0,0,491]
[null,"Harry Bateman","260$28","270$7","290$19","1000$12",null,null,4,5,290,19,1000,12,725.16129032258073]
[null,"Jordan Mullaney","210$51","240$13","270$7",null,null,null,4,0,270,7,0,0,277]
[null,"Sam Lee","270$5","350$13","1000$10",null,null,null,5,0,1000,10,0,0,1100]
[null,"Adam Stephens","170$9","350$13","1000$10",null,null,null,5,0,1000,10,0,0,1100]
[null,"Max McCardle","250$6","270$5","280$19","690$7","700$9",null,4,4,280,19,690,7,579.61538461538464]
[null,"Rory Bourke","350$9","600$12","900$6",null,null,null,4,0,900,6,0,0,906]
[null,"Tim Hart","270$12","290$7","300$5",null,null,null,4,0,300,5,0,0,305]
[null,"Matthew Giles","330$22","350$9","480$10",null,null,null,4,0,480,10,0,0,490]
[null,"Benjamin Clementson","350$9","400$18","700$6",null,null,null,4,0,700,6,0,0,706]
[null,"Brad Moules","350$9","400$18","700$6",null,null,null,4,0,700,6,0,0,706]
[null,"Antonio Murdaca","270$12","350$5","360$11",null,null,null,4,0,360,11,0,0,371]
[null,"Maverick Antcliff","260$28","290$7","300$31","1000$12",null,null,4,5,300,31,1000,12,804.65116279069775]
[null,"Neven Basic","330$10","400$18","480$10",null,null,null,4,0,480,10,0,0,490]
[null,"Rick Kulacz","260$28","280$7","290$13",null,null,null,4,0,290,13,0,0,303]
[null,"Aaron Wilkin","400$18","420$5","480$10",null,null,null,4,0,480,10,0,0,490]
[null,"Ruben Sondjaja","350$9","400$29","410$6",null,null,null,4,0,410,6,0,0,416]
[null,"Anthony Marchesani","270$5","350$13","1000$10",null,null,null,5,0,1000,10,0,0,1100]
[null,"Anthony Summers","270$5","350$13","1000$10",null,null,null,5,0,1000,10,0,0,1100]
[null,"Mathew Perry","380$5","400$23","410$9",null,null,null,4,0,410,9,0,0,419]
[null,"James Anstiss","270$5","350$13","1000$9",null,null,null,5,0,1000,9,0,0,1090]
[null,"Troy Moses","250$6","300$16","330$25",null,null,null,4,0,330,25,0,0,355]
[null,"Alex Edge","270$5","350$13","1000$9",null,null,null,5,0,1000,9,0,0,1090]
[null,"Mitchell Brown","350$9","500$15","900$5",null,null,null,4,0,900,5,0,0,905]
[null,"Peter Cooke","400$18","420$5","480$11",null,null,null,4,0,480,11,0,0,{"$f":"IF(M132,K132+(M132-K132)*L132/(L132+N132),K132+IF(K132=1000,L132*10,L132))","v":491}]
[null,"Dale Williamson","270$5","350$13","1000$9",null,null,null,5,0,1000,9,0,0,1090]
[null,"Ryan Lynch","330$22","340$10","700$8",null,null,null,4,0,700,8,0,0,708]
[null,"Blake Proverbs","48$6","60$6","90$83","250$7","500$10",null,3,4,90,83,250,7,237.55555555555554]
[null,"Mark Hensby","270$5","330$10","340$8",null,null,null,4,0,340,8,0,0,348]
[null,"Jediah Morgan","270$5","350$9","1000$11",null,null,null,5,0,1000,11,0,0,1110]
[null,"Linus Yip","270$5","350$9","1000$11",null,null,null,5,0,1000,11,0,0,1110]
[null,"Andrew Evans","330$22","350$9","360$7",null,null,null,4,0,360,7,0,0,367]
[null,"Sam An","270$5","350$9","1000$11",null,null,null,5,0,1000,11,0,0,1110]
[null,"Matthew Lisk","270$5","350$9","1000$11",null,null,null,5,0,1000,11,0,0,1110]
[null,"Anthony Choat","270$5","350$9","1000$11",null,null,null,5,0,1000,11,0,0,1110]
[null,"Charlie Dann","330$33","340$5","360$6",null,null,null,4,0,360,6,0,0,366]
[null,"Martin Dive","270$5","350$9","1000$11",null,null,null,5,0,1000,11,0,0,1110]
[null,"Mitch Davis","270$5","350$9","600$18",null,null,null,4,0,600,18,0,0,618]
[null,"Campbell Rawson",null,"95$14","100$10",null,null,null,4,0,100,10,0,0,110]
[null,"About Betfair",null,null,null,null,null,null,{"$error":"#VALUE!"},0,{"$error":"#VALUE!"},{"$error":"#VALUE!"},0,0,{"$error":"#VALUE!"}]
[null,null,null,null,null,null,null,null,{"$error":"#VALUE!"},0,{"$error":"#VALUE!"},{"$error":"#VALUE!"},0,0,{"$error":"#VALUE!"}]
[null,"Help & Contact Us",null,null,null,null,null,null,{"$error":"#VALUE!"},0,{"$error":"#VALUE!"},{"$error":"#VALUE!"},0,0,{"$error":"#VALUE!"}]
[null,null,null,null,null,null,null,null,{"$error":"#VALUE!"},0,{"$error":"#VALUE!"},{"$error":"#VALUE!"},0,0,{"$error":"#VALUE!"}]
[null,"Affiliates",null,null,null,null,null,null,{"$error":"#VALUE!"},0,{"$error":"#VALUE!"},{"$error":"#VALUE!"},0,0,{"$error":"#VALUE!"}]
[null,null,null,null,null,null,null,null,{"$error":"#VALUE!"},0,{"$error":"#VALUE!"},{"$error":"#VALUE!"},0,0,{"$error":"#VALUE!"}]
[null,"The Hub",null,null,null,null,null,null,{"$error":"#VALUE!"},0,{"$error":"#VALUE!"},{"$error":"#VALUE!"},0,0,{"$error":"#VALUE!"}]
[null,null,null,null,null,null,null,null,{"$error":"#VALUE!"},0,{"$error":"#VALUE!"},{"$error":"#VALUE!"},0,0,{"$error":"#VALUE!"}]
[null,"Betfair Mobile",null,null,null,null,null,null,{"$error":"#VALUE!"},0,{"$error":"#VALUE!"},{"$error":"#VALUE!"},0,0,{"$error":"#VALUE!"}]
[null,null,null,null,null,null,null,null,{"$error":"#VALUE!"},0,{"$error":"#VALUE!"},{"$error":"#VALUE!"},0,0,{"$error":"#VALUE!"}]
[null,"Developers",null,null,null,null,null,null,{"$error":"#VALUE!"},0,{"$error":"#VALUE!"},{"$error":"#VALUE!"},0,0,{"$error":"#VALUE!"}]
[null,null,null,null,null,null,null,null,{"$f":"FIND(\"$\",E158)","v":{"$error":"#VALUE!"}},{"$f":"IF(ISBLANK(F158),0,FIND(\"$\",F158))","v":0},{"$f":"VALUE(LEFT(E158,I158-1))","v":{"$error":"#VALUE!"}},{"$f":"VALUE(RIGHT(E158,LEN(E158)-I158))","v":{"$error":"#VALUE!"}},{"$f":"IF(J158,VALUE(LEFT(F158,J158-1)),0)","v":0},{"$f":"IF(J158,VALUE(RIGHT(F158,LEN(F158)-J158)),0)","v":0},{"$error":"#VALUE!"}]
[]
[]
[null,"Help & Contact Us"]
[]
[null,"Affiliates"]
[]
[null,"The Hub"]
[]
[null,"Betfair Mobile"]
[]
[null,"Developers"]